siglum,marginalia,folio,sequence,incipit,feast,office,genre,position,cantus_id,mode,finalis,differentia,differentiae_database,fulltext_standardized,fulltext_ms,volpiano,image_link,melody_id,addendum,extra,node_id
D-BAs Msc.Lit.25,,001r,1,Ecce dies veniunt dicit,Dom. 1 Adventus,V,R,,006583,?,,,,,,,http://digital.bib-bvb.de/webclient/DeliveryManager?pid=18742432,,,,185145
D-BAs Msc.Lit.25,,001r,2,In diebus illis salvabitur,Dom. 1 Adventus,V,V,01,006583a,?,,,,,,,http://digital.bib-bvb.de/webclient/DeliveryManager?pid=18742432,,,,185146
D-BAs Msc.Lit.25,,001r,3,Veni redemptor*,Dom. 1 Adventus,V,H,,008408a,*,,,,,,,http://digital.bib-bvb.de/webclient/DeliveryManager?pid=18742432,,,,185147
D-BAs Msc.Lit.25,,001r,4,Ecce nomen domini venit de,Dom. 1 Adventus,V,A,M,002527,?,,?,,,,,http://digital.bib-bvb.de/webclient/DeliveryManager?pid=18742432,,,,185148
D-BAs Msc.Lit.25,,001r,5,-- --*,Dom. 1 Adventus,C,H,,,*,,,,-- --*,,,http://digital.bib-bvb.de/webclient/DeliveryManager?pid=18742432,,,,185149
D-BAs Msc.Lit.25,,001r,6,Qui venturus est veniet et,Dom. 1 Adventus,C,A,,004502,?,,?,,,,,http://digital.bib-bvb.de/webclient/DeliveryManager?pid=18742432,,,,185150
D-BAs Msc.Lit.25,,001r,7,Dominum qui venturus est,Dom. 1 Adventus,M,I,,001068,4,,GR,,,,,http://digital.bib-bvb.de/webclient/DeliveryManager?pid=18742432,,,,185151
D-BAs Msc.Lit.25,,001v,1,Hora est jam nos de ,Dom. 1 Adventus,M,A,1.,003134,8?,,*,,,,,http://digital.bib-bvb.de/webclient/DeliveryManager?pid=18742433,,,,185152
D-BAs Msc.Lit.25,,001v,2,Aspiciens a longe ecce video,Dom. 1 Adventus,M,R,1.1,006129,7,,,,,,,http://digital.bib-bvb.de/webclient/DeliveryManager?pid=18742433,,,,185153
D-BAs Msc.Lit.25,,001v,3,Quique terrigenae et fili,Dom. 1 Adventus,M,V,01,006129a,7,,,,,,,http://digital.bib-bvb.de/webclient/DeliveryManager?pid=18742433,,,,185154
D-BAs Msc.Lit.25,,001v,4,Qui regis Israel intende qui,Dom. 1 Adventus,M,V,02,006129b,7,,,,,,,http://digital.bib-bvb.de/webclient/DeliveryManager?pid=18742433,,,,185155
D-BAs Msc.Lit.25,,001v,5,Tollite portas principes,Dom. 1 Adventus,M,V,03,006129c,7,,,,,,,http://digital.bib-bvb.de/webclient/DeliveryManager?pid=18742433,,,,185156
D-BAs Msc.Lit.25,,002r,1,Aspiciebam in visu noctis et,Dom. 1 Adventus,M,R,1.2,006128,6,,,,,,,http://digital.bib-bvb.de/webclient/DeliveryManager?pid=18742434,,,,185157
D-BAs Msc.Lit.25,,002r,2,Ecce dominator dominus cum,Dom. 1 Adventus,M,V,01,006128a,6,,,,,,,http://digital.bib-bvb.de/webclient/DeliveryManager?pid=18742434,,,,185158
D-BAs Msc.Lit.25,,002r,3,Missus est Gabriel angelus ad,Dom. 1 Adventus,M,R,1.3,007170,7,,,,,,,http://digital.bib-bvb.de/webclient/DeliveryManager?pid=18742434,,,,185159
D-BAs Msc.Lit.25,,002r,4,Ave Maria gratia plena,Dom. 1 Adventus,M,V,01,007170a,7S,,,,,,,http://digital.bib-bvb.de/webclient/DeliveryManager?pid=18742434,,,,185160
D-BAs Msc.Lit.25,,002r,5,Nox praecessit dies autem,Dom. 1 Adventus,M,A,2.,003967,6?,,*,,,,,http://digital.bib-bvb.de/webclient/DeliveryManager?pid=18742434,,,,185161
D-BAs Msc.Lit.25,,002r,6,Egredietur dominus*,Dom. 1 Adventus,M,W,2.,008043,*,,,,,,,http://digital.bib-bvb.de/webclient/DeliveryManager?pid=18742434,,,,185162
D-BAs Msc.Lit.25,,002r,7,Ave Maria gratia plena,Dom. 1 Adventus,M,R,2.1,006157,7,,,,,,,http://digital.bib-bvb.de/webclient/DeliveryManager?pid=18742434,,,,185163
D-BAs Msc.Lit.25,,002v,1,Tollite portas principes*,Dom. 1 Adventus,M,V,01,006157b,7,,,,,,,http://digital.bib-bvb.de/webclient/DeliveryManager?pid=18742435,,,,185164
D-BAs Msc.Lit.25,,002v,2,Salvatorem exspectamus,Dom. 1 Adventus,M,R,2.2,007562,3,,,,,,,http://digital.bib-bvb.de/webclient/DeliveryManager?pid=18742435,,,,185165
D-BAs Msc.Lit.25,,002v,3,Praeoccupemus faciem ejus in,Dom. 1 Adventus,M,V,01,007562a,3,,,,,,,http://digital.bib-bvb.de/webclient/DeliveryManager?pid=18742435,,,,185166
D-BAs Msc.Lit.25,,002v,4,Audite verbum domini gentes,Dom. 1 Adventus,M,R,2.3,006149,3,,,,,,,http://digital.bib-bvb.de/webclient/DeliveryManager?pid=18742435,,,,185167
D-BAs Msc.Lit.25,,002v,5,A solis ortu et occasu ,Dom. 1 Adventus,M,V,01,006149a,3,,,,,,,http://digital.bib-bvb.de/webclient/DeliveryManager?pid=18742435,,,,185168
D-BAs Msc.Lit.25,,002v,6,Scientes quia hora est jam,Dom. 1 Adventus,M,A,3.,004828,5T,,*,,,,,http://digital.bib-bvb.de/webclient/DeliveryManager?pid=18742435,,,,185169
D-BAs Msc.Lit.25,,002v,7,Ex Sion species*,Dom. 1 Adventus,M,W,3.,008060,*,,,,,,,http://digital.bib-bvb.de/webclient/DeliveryManager?pid=18742435,,,,185170
D-BAs Msc.Lit.25,,003r,1,Ecce virgo concipiet et,Dom. 1 Adventus,M,R,3.1,006620,3,,,,,,,http://digital.bib-bvb.de/webclient/DeliveryManager?pid=18742436,,,,185171
D-BAs Msc.Lit.25,,003r,2,Tollite portas principes*,Dom. 1 Adventus,M,V,01,006620a,3,,,,,,,http://digital.bib-bvb.de/webclient/DeliveryManager?pid=18742436,,,,185172
D-BAs Msc.Lit.25,,003r,3,Obsecro domine mitte quem,Dom. 1 Adventus,M,R,3.2,007305,5,,,,,,,http://digital.bib-bvb.de/webclient/DeliveryManager?pid=18742436,,,,185173
D-BAs Msc.Lit.25,,003r,4,A solis*,Dom. 1 Adventus,M,V,01,007305a,5,,,,,,,http://digital.bib-bvb.de/webclient/DeliveryManager?pid=18742436,,,,185174
D-BAs Msc.Lit.25,,003r,5,Laetentur caeli et exsultet,Dom. 1 Adventus,M,R,3.3,007068,6?,,,,,,,http://digital.bib-bvb.de/webclient/DeliveryManager?pid=18742436,,,,185175
D-BAs Msc.Lit.25,,003r,6,Ecce dominator dominus*,Dom. 1 Adventus,M,V,01,007068a,6S,,,,,,,http://digital.bib-bvb.de/webclient/DeliveryManager?pid=18742436,,,,185176
D-BAs Msc.Lit.25,,003r,7,In illa die stillabunt montes,Dom. 1 Adventus,L,A,1,003244,8,,G,123h,,,,http://digital.bib-bvb.de/webclient/DeliveryManager?pid=18742436,,,,185177
D-BAs Msc.Lit.25,,003r,8,Jucundare filia Sion exsulta,Dom. 1 Adventus,L,A,2,003509,8,,G,123h,,,,http://digital.bib-bvb.de/webclient/DeliveryManager?pid=18742436,,,,185178
D-BAs Msc.Lit.25,,003r,9,Ecce dominus veniet et omnes,Dom. 1 Adventus,L,A,3,002509,5,,A,129a,,,,http://digital.bib-bvb.de/webclient/DeliveryManager?pid=18742436,,,,185179
D-BAs Msc.Lit.25,,003r,10,Omnes sitientes venite ad,Dom. 1 Adventus,L,A,4,004133,7,,C,141i,,,,http://digital.bib-bvb.de/webclient/DeliveryManager?pid=18742436,,,,185180
D-BAs Msc.Lit.25,,003v,1,Ecce veniet propheta magnus,Dom. 1 Adventus,L,A,5,002552,4,,G,45a,,,,http://digital.bib-bvb.de/webclient/DeliveryManager?pid=18742437,,,,185181
D-BAs Msc.Lit.25,,003v,2,Spiritus sanctus in te,Dom. 1 Adventus,L,A,B,005006,8,,G,123h,,,,http://digital.bib-bvb.de/webclient/DeliveryManager?pid=18742437,,,,185182
D-BAs Msc.Lit.25,,003v,3,Dicite filiae Sion ecce rex,Dom. Adventus,P,A,,002201,8,,G1,211a,,,,http://digital.bib-bvb.de/webclient/DeliveryManager?pid=18742437,,,,185183
D-BAs Msc.Lit.25,,003v,4,Veni et libera nos deus,Dom. Adventus,T,A,,005324,8?,,*,,,,,http://digital.bib-bvb.de/webclient/DeliveryManager?pid=18742437,,,,185184
D-BAs Msc.Lit.25,,003v,5,Veni ad liberandum nos domine,Dom. Adventus,T,R,,007823,r,,,,,,,http://digital.bib-bvb.de/webclient/DeliveryManager?pid=18742437,,,,185185
D-BAs Msc.Lit.25,,003v,6,Et ostende faciem tuam et,Dom. Adventus,T,V,01,007823a,r,,,,,,,http://digital.bib-bvb.de/webclient/DeliveryManager?pid=18742437,,,,185186
D-BAs Msc.Lit.25,,003v,7,Timebunt gentes*,Dom. Adventus,T,W,,008221,*,,,,,,,http://digital.bib-bvb.de/webclient/DeliveryManager?pid=18742437,,,,185187
D-BAs Msc.Lit.25,,003v,8,Tuam domine excita potentiam,Dom. Adventus,S,A,,005229,4?,,G,,,,,http://digital.bib-bvb.de/webclient/DeliveryManager?pid=18742437,,,,185188
D-BAs Msc.Lit.25,,003v,9,Ostende nobis domine,Dom. Adventus,S,R,,007343,r,,,,,,,http://digital.bib-bvb.de/webclient/DeliveryManager?pid=18742437,,,,185189
D-BAs Msc.Lit.25,,003v,10,Et salutare tuum da nobis,Dom. Adventus,S,V,01,007343a,r,,,,,,,http://digital.bib-bvb.de/webclient/DeliveryManager?pid=18742437,,,,185190
D-BAs Msc.Lit.25,,003v,11,Domine deus virtutum,Dom. Adventus,S,W,,008023,*,,,,,,,http://digital.bib-bvb.de/webclient/DeliveryManager?pid=18742437,,,,185191
D-BAs Msc.Lit.25,,003v,12,In tuo adventu erue nos,Dom. Adventus,N,A,,003302,1?,,G,,,,,http://digital.bib-bvb.de/webclient/DeliveryManager?pid=18742437,,,,185192
D-BAs Msc.Lit.25,,003v,13,Super te Jerusalem orietur,Dom. Adventus,N,R,,007728,r,,,,,,,http://digital.bib-bvb.de/webclient/DeliveryManager?pid=18742437,,,,185193
D-BAs Msc.Lit.25,,003v,14,Et gloria ejus in te,Dom. Adventus,N,V,01,007728a,r,,,,,,,http://digital.bib-bvb.de/webclient/DeliveryManager?pid=18742437,,,,185194
D-BAs Msc.Lit.25,,003v,15,Memento nostri domine*,Dom. Adventus,N,W,,008137,*,,,,,,,http://digital.bib-bvb.de/webclient/DeliveryManager?pid=18742437,,,,185195
D-BAs Msc.Lit.25,,003v,16,Tu exsurgens domine,Dom. Adventus,V2,R,,007790,r,,,,,,,http://digital.bib-bvb.de/webclient/DeliveryManager?pid=18742437,,,,185196
D-BAs Msc.Lit.25,,004r,1,Quia tempus miserendi ejus,Dom. Adventus,V2,V,01,007790a,r,,,,,,,http://digital.bib-bvb.de/webclient/DeliveryManager?pid=18742438,,,,185197
D-BAs Msc.Lit.25,,004r,2,Ne timeas Maria invenisti,Dom. Adventus,V2,A,M,003863,8T,,G,123h,,,,http://digital.bib-bvb.de/webclient/DeliveryManager?pid=18742438,,,,185198
D-BAs Msc.Lit.25,,004r,3,Angelus domini nuntiavit,Fer. 2 Hebd. 1 Adv.,E,A,1,001414,1?,,G,,,,,http://digital.bib-bvb.de/webclient/DeliveryManager?pid=18742438,,,,185199
D-BAs Msc.Lit.25,,004r,4,Jerusalem respice ad orientem,Fer. 2 Hebd. 1 Adv.,E,A,2,003481,7,,D,147c,,,,http://digital.bib-bvb.de/webclient/DeliveryManager?pid=18742438,,,,185200
D-BAs Msc.Lit.25,,004r,5,Antequam convenirent inventa,Fer. 3 Hebd. 1 Adv.,E,A,1,001440,1,,G,66iii,,,,http://digital.bib-bvb.de/webclient/DeliveryManager?pid=18742438,,,,185201
D-BAs Msc.Lit.25,,004r,6,Quaerite dominum dum inveniri,Fer. 3 Hebd. 1 Adv.,E,A,2,004429,4,,E2,41b,,,,http://digital.bib-bvb.de/webclient/DeliveryManager?pid=18742438,,,,185202
D-BAs Msc.Lit.25,,004r,7,De Sion exibit lex et ,Fer. 4 Hebd. 1 Adv.,E,A,1,002119,2,,D,152f,,,,http://digital.bib-bvb.de/webclient/DeliveryManager?pid=18742438,,,,185203
D-BAs Msc.Lit.25,,004r,8,Veniet fortior me post me,Fer. 4 Hebd. 1 Adv.,E,A,2,005339,8,,C,135b,,,,http://digital.bib-bvb.de/webclient/DeliveryManager?pid=18742438,,,,185204
D-BAs Msc.Lit.25,,004r,9,Benedicta tu in mulieribus et,Fer. 5 Hebd. 1 Adv.,E,A,1,001709,4,,G,45a,,,,http://digital.bib-bvb.de/webclient/DeliveryManager?pid=18742438,,,,185205
D-BAs Msc.Lit.25,,004r,10,Exspectabo dominum salvatorem,Fer. 5 Hebd. 1 Adv.,E,A,2,002805,4,,G,45a,,,,http://digital.bib-bvb.de/webclient/DeliveryManager?pid=18742438,,,,185206
D-BAs Msc.Lit.25,,004v,1,Ecce veniet deus et homo ,Fer. 6 Hebd. 1 Adv.,E,A,1,002549,1,,A1,67a,,,,http://digital.bib-bvb.de/webclient/DeliveryManager?pid=18742439,,,,185207
D-BAs Msc.Lit.25,,004v,2,Ex Aegypto vocavi filium meum,Fer. 6 Hebd. 1 Adv.,E,A,2,002743,4,,G,45a,,,,http://digital.bib-bvb.de/webclient/DeliveryManager?pid=18742439,,,,185208
D-BAs Msc.Lit.25,,004v,3,Sion noli timere ecce deus,Sabbato Hebd. 1 Adv.,E,A,1,004969,4,,A1,40a,,,,http://digital.bib-bvb.de/webclient/DeliveryManager?pid=18742439,,,,185209
D-BAs Msc.Lit.25,,004v,4,Leva Jerusalem oculos et vide,Sabbato Hebd. 1 Adv.,E,A,2,003606,1,,A1,67a,,,,http://digital.bib-bvb.de/webclient/DeliveryManager?pid=18742439,,,,185210
D-BAs Msc.Lit.25,,004v,5,Rex noster adveniet Christus,Dom. 2 Adventus,M,I,,001155,4,,GR,,,,,http://digital.bib-bvb.de/webclient/DeliveryManager?pid=18742439,,,,185211
D-BAs Msc.Lit.25,,004v,6,Jerusalem cito veniet salus,Dom. 2 Adventus,M,R,1,007031,4,,,,,,,http://digital.bib-bvb.de/webclient/DeliveryManager?pid=18742439,,,,185212
D-BAs Msc.Lit.25,,004v,7,Israel si me audieris non,Dom. 2 Adventus,M,V,01,007031a,4S,,,,,,,http://digital.bib-bvb.de/webclient/DeliveryManager?pid=18742439,,,,185213
D-BAs Msc.Lit.25,,004v,8,Ecce dominus veniet et omnes,Dom. 2 Adventus,M,R,2,006586,5,,,,,,,http://digital.bib-bvb.de/webclient/DeliveryManager?pid=18742439,,,,185214
D-BAs Msc.Lit.25,,005r,1,Ecce dominus cum virtute,Dom. 2 Adventus,M,V,01,006586b,5,,,,,,,http://digital.bib-bvb.de/webclient/DeliveryManager?pid=18742440,,,,185215
D-BAs Msc.Lit.25,,005r,2,Jerusalem surge et sta in,Dom. 2 Adventus,M,R,3,007034,1?,,,,,,,http://digital.bib-bvb.de/webclient/DeliveryManager?pid=18742440,,,,185216
D-BAs Msc.Lit.25,,005r,3,Leva in circuitu oculos tuos,Dom. 2 Adventus,M,V,01,007034a,1,,,,,,,http://digital.bib-bvb.de/webclient/DeliveryManager?pid=18742440,,,,185217
D-BAs Msc.Lit.25,,005r,4,Civitas Jerusalem noli flere,Dom. 2 Adventus,M,R,4,006290,1,,,,,,,http://digital.bib-bvb.de/webclient/DeliveryManager?pid=18742440,,,,185218
D-BAs Msc.Lit.25,,005r,5,Ecce dominator*,Dom. 2 Adventus,M,V,01,006290a,1,,,,,,,http://digital.bib-bvb.de/webclient/DeliveryManager?pid=18742440,,,,185219
D-BAs Msc.Lit.25,,005r,6,Ecce veniet dominus protector,Dom. 2 Adventus,M,R,5,006613,5,,,,,,,http://digital.bib-bvb.de/webclient/DeliveryManager?pid=18742440,,,,185220
D-BAs Msc.Lit.25,,005r,7,Ecce dominator*,Dom. 2 Adventus,M,V,01,006613a,5S,,,,,,,http://digital.bib-bvb.de/webclient/DeliveryManager?pid=18742440,,,,185221
D-BAs Msc.Lit.25,,005r,8,Sicut mater consolatur filios,Dom. 2 Adventus,M,R,6,007660,8,,,,,,,http://digital.bib-bvb.de/webclient/DeliveryManager?pid=18742440,,,,185222
D-BAs Msc.Lit.25,,005v,1,Deus a Libano veniet et,Dom. 2 Adventus,M,V,01,007660a,8,,,,,,,http://digital.bib-bvb.de/webclient/DeliveryManager?pid=18742441,,,,185223
D-BAs Msc.Lit.25,,005v,2,Jerusalem plantabis vineam in,Dom. 2 Adventus,M,R,7,007033,8,,,,,,,http://digital.bib-bvb.de/webclient/DeliveryManager?pid=18742441,,,,185224
D-BAs Msc.Lit.25,,005v,3,Deus a Libano*,Dom. 2 Adventus,M,V,01,007033a,8,,,,,,,http://digital.bib-bvb.de/webclient/DeliveryManager?pid=18742441,,,,185225
D-BAs Msc.Lit.25,,005v,4,Egredietur dominus de Samaria,Dom. 2 Adventus,M,R,8,006639,3,,,,,,,http://digital.bib-bvb.de/webclient/DeliveryManager?pid=18742441,,,,185226
D-BAs Msc.Lit.25,,005v,5,Ex Sion species decoris ejus,Dom. 2 Adventus,M,V,01,006639c,3,,,,,,,http://digital.bib-bvb.de/webclient/DeliveryManager?pid=18742441,,,,185227
D-BAs Msc.Lit.25,,006r,1,Rex noster adveniet Christus,Dom. 2 Adventus,M,R,9,007547,4,,,,,,,http://digital.bib-bvb.de/webclient/DeliveryManager?pid=18742442,,,,185228
D-BAs Msc.Lit.25,,006r,2,Ecce agnus dei ecce qui,Dom. 2 Adventus,M,V,01,007547a,4,,,,,,,http://digital.bib-bvb.de/webclient/DeliveryManager?pid=18742442,,,,185229
D-BAs Msc.Lit.25,,006r,3,Ecce in nubibus caeli dominus,Dom. 2 Adventus,L,A,1,002515,1,,G,66iii,,,,http://digital.bib-bvb.de/webclient/DeliveryManager?pid=18742442,,,,185230
D-BAs Msc.Lit.25,,006r,4,Urbs fortitudinis nostrae,Dom. 2 Adventus,L,A,2,005281,7,,D,147c,,,,http://digital.bib-bvb.de/webclient/DeliveryManager?pid=18742442,,,,185231
D-BAs Msc.Lit.25,,006r,5,Ecce apparebit dominus et non,Dom. 2 Adventus,L,A,3,002492,7,,A,143b,,,,http://digital.bib-bvb.de/webclient/DeliveryManager?pid=18742442,,,,185232
D-BAs Msc.Lit.25,,006r,6,Montes et colles cantabant,Dom. 2 Adventus,L,A,4,003805,1,,G,66iii,,,,http://digital.bib-bvb.de/webclient/DeliveryManager?pid=18742442,,,,185233
D-BAs Msc.Lit.25,,006r,7,Ecce dominus noster cum,Dom. 2 Adventus,L,A,5,002508,3,,C1,86b,,,,http://digital.bib-bvb.de/webclient/DeliveryManager?pid=18742442,,,,185234
D-BAs Msc.Lit.25,,006r,8,Super solium David et super,Dom. 2 Adventus,L,A,B,005064,8,,G,123h,,,,http://digital.bib-bvb.de/webclient/DeliveryManager?pid=18742442,,,,185235
D-BAs Msc.Lit.25,,006v,1,Beata es Maria quae,Dom. 2 Adventus,V2,A,M,001565,8,,G,123h,,,,http://digital.bib-bvb.de/webclient/DeliveryManager?pid=18742443,,,,185236
D-BAs Msc.Lit.25,,006v,2,De caelo veniet dominator,Fer. 2 Hebd. 2 Adv.,E,A,1,002104,7,,A,143b,,,,http://digital.bib-bvb.de/webclient/DeliveryManager?pid=18742443,,,,185237
D-BAs Msc.Lit.25,,006v,3,Ecce rex veniet dominus,Fer. 2 Hebd. 2 Adv.,E,A,2,002543,4,,A,235a,,,,http://digital.bib-bvb.de/webclient/DeliveryManager?pid=18742443,,,,185238
D-BAs Msc.Lit.25,,006v,4,Super te Jerusalem orietur,Fer. 3 Hebd. 2 Adv.,E,A,1,005065,4,,A,235a,,,,http://digital.bib-bvb.de/webclient/DeliveryManager?pid=18742443,,,,185239
D-BAs Msc.Lit.25,,006v,5,Vox clamantis in deserto,Fer. 3 Hebd. 2 Adv.,E,A,2,005506,5,,G,131a,,,,http://digital.bib-bvb.de/webclient/DeliveryManager?pid=18742443,,,,185240
D-BAs Msc.Lit.25,,006v,6,Ecce mitto angelum meum qui,Fer. 4 Hebd. 2 Adv.,E,A,1,002525,7,,A,143b,,,,http://digital.bib-bvb.de/webclient/DeliveryManager?pid=18742443,,,,185241
D-BAs Msc.Lit.25,,006v,7,Sion renovaberis et videbis,Fer. 4 Hebd. 2 Adv.,E,A,2,004970,4,,A1,40a,,,,http://digital.bib-bvb.de/webclient/DeliveryManager?pid=18742443,,,,185242
D-BAs Msc.Lit.25,,006v,8,Tu es qui venturus es ,Fer. 5 Hebd. 2 Adv.,E,A,1,005210,7,,C,141i,,,,http://digital.bib-bvb.de/webclient/DeliveryManager?pid=18742443,,,,185243
D-BAs Msc.Lit.25,,006v,9,Qui post me venit ante ,Fer. 5 Hebd. 2 Adv.,E,A,2,004493,4,,A,235a,,,,http://digital.bib-bvb.de/webclient/DeliveryManager?pid=18742443,,,,185244
D-BAs Msc.Lit.25,,007r,1,Cantate domino canticum novum,Fer. 6 Hebd. 2 Adv.,E,A,1,001763,7,,C,141i,,,,http://digital.bib-bvb.de/webclient/DeliveryManager?pid=18742444,,,,185245
D-BAs Msc.Lit.25,,007r,2,Erumpent montes jucunditatem,Fer. 6 Hebd. 2 Adv.,E,A,2,002675,7,,A,143b,,,,http://digital.bib-bvb.de/webclient/DeliveryManager?pid=18742444,,,,185246
D-BAs Msc.Lit.25,,007r,3,Levabit dominus signum in,Sabbato Hebd. 2 Adv.,E,A,1,003607,1,,G,66iii,,,,http://digital.bib-bvb.de/webclient/DeliveryManager?pid=18742444,,,,185247
D-BAs Msc.Lit.25,,007r,4,Ante me non est formatus ,Sabbato Hebd. 2 Adv.,E,A,2,001436,1,,G?,,,,,http://digital.bib-bvb.de/webclient/DeliveryManager?pid=18742444,,,,185248
D-BAs Msc.Lit.25,,007r,5,In tua patientia possedisti,Luciae,V,A,M,003301,1,,G,66iii,,,,http://digital.bib-bvb.de/webclient/DeliveryManager?pid=18742444,,,,185249
D-BAs Msc.Lit.25,,007r,6,Lucia virgo quid a me ,Luciae,M,R,1,007106,7,,,,,,,http://digital.bib-bvb.de/webclient/DeliveryManager?pid=18742444,,,,185250
D-BAs Msc.Lit.25,,007v,1,Sicut per me civitas,Luciae,M,V,01,007106a,7,,,,,,,http://digital.bib-bvb.de/webclient/DeliveryManager?pid=18742445,,,,185251
D-BAs Msc.Lit.25,,007v,2,Rogavi dominum meum Jesum,Luciae,M,R,2,007550,3,,,,,,,http://digital.bib-bvb.de/webclient/DeliveryManager?pid=18742445,,,,185252
D-BAs Msc.Lit.25,,007v,3,Pro eo ut me diligerent,Luciae,M,V,01,007550a,3,,,,,,,http://digital.bib-bvb.de/webclient/DeliveryManager?pid=18742445,,,,185253
D-BAs Msc.Lit.25,,007v,4,Grata facta est a domino ,Luciae,M,R,3,006789,5,,,,,,,http://digital.bib-bvb.de/webclient/DeliveryManager?pid=18742445,,,,185254
D-BAs Msc.Lit.25,,007v,5,Adjuvabit eam deus vultu suo,Luciae,M,V,01,006789a,5,,,,,,,http://digital.bib-bvb.de/webclient/DeliveryManager?pid=18742445,,,,185255
D-BAs Msc.Lit.25,,007v,6,Orante sancta Lucia apparuit,Luciae,L,A,1,004178,7,,A,143b,,,,http://digital.bib-bvb.de/webclient/DeliveryManager?pid=18742445,,,,185256
D-BAs Msc.Lit.25,,007v,7,Lucia virgo quid a me ,Luciae,L,A,2,003639,7,,A,143b,,,,http://digital.bib-bvb.de/webclient/DeliveryManager?pid=18742445,,,,185257
D-BAs Msc.Lit.25,,008r,1,Per te Lucia virgo civitas,Luciae,L,A,3,004267,8,,G,123h,,,,http://digital.bib-bvb.de/webclient/DeliveryManager?pid=18742446,,,,185258
D-BAs Msc.Lit.25,,008r,2,Benedico te pater domini mei,Luciae,L,A,4,001703,8,,G,123h,,,,http://digital.bib-bvb.de/webclient/DeliveryManager?pid=18742446,,,,185259
D-BAs Msc.Lit.25,,008r,3,Tanto pondere eam fixit,Luciae,L,A,5,005110,7,,C1,144a,,,,http://digital.bib-bvb.de/webclient/DeliveryManager?pid=18742446,,,,185260
D-BAs Msc.Lit.25,,008r,4,Columna es immobilis Lucia,Luciae,L,A,B,001855,1,,G,66iii,,,,http://digital.bib-bvb.de/webclient/DeliveryManager?pid=18742446,,,,185261
D-BAs Msc.Lit.25,,008r,5,Soror mea Lucia virgo deo,Luciae,V2,A,M,004984,8,,G,123h,,,,http://digital.bib-bvb.de/webclient/DeliveryManager?pid=18742446,,,,185262
D-BAs Msc.Lit.25,,008r,6,Surgite vigilemus quia veniet,Dom. 3 Adventus,M,I,,001164,2,,2,,,,,http://digital.bib-bvb.de/webclient/DeliveryManager?pid=18742446,,,,185263
D-BAs Msc.Lit.25,,008r,7,Ecce apparebit dominus super,Dom. 3 Adventus,M,R,1,006578,1,,,,,,,http://digital.bib-bvb.de/webclient/DeliveryManager?pid=18742446,,,,185264
D-BAs Msc.Lit.25,,008v,1,Ecce dominator dominus*,Dom. 3 Adventus,M,V,01,006578b,1,,,,,,,http://digital.bib-bvb.de/webclient/DeliveryManager?pid=18742447,,,,185265
D-BAs Msc.Lit.25,,008v,2,Bethleem civitas dei summi ex,Dom. 3 Adventus,M,R,2,006254,7,,,,,,,http://digital.bib-bvb.de/webclient/DeliveryManager?pid=18742447,,,,185266
D-BAs Msc.Lit.25,,008v,3,Deus a Libano veniet*,Dom. 3 Adventus,M,V,01,006254a,7,,,,,,,http://digital.bib-bvb.de/webclient/DeliveryManager?pid=18742447,,,,185267
D-BAs Msc.Lit.25,,008v,4,Qui venturus est veniet et,Dom. 3 Adventus,M,R,3,007485,6,,,,,,,http://digital.bib-bvb.de/webclient/DeliveryManager?pid=18742447,,,,185268
D-BAs Msc.Lit.25,,008v,5,Ex Sion species decoris ejus,Dom. 3 Adventus,M,V,01,007485a,6,,,,,,,http://digital.bib-bvb.de/webclient/DeliveryManager?pid=18742447,,,,185269
D-BAs Msc.Lit.25,,008v,6,Suscipe verbum virgo Maria,Dom. 3 Adventus,M,R,4,007744,4,,,,,,,http://digital.bib-bvb.de/webclient/DeliveryManager?pid=18742447,,,,185270
D-BAs Msc.Lit.25,,008v,7,Ave Maria gratia*,Dom. 3 Adventus,M,V,01,007744a,4,,,,,,,http://digital.bib-bvb.de/webclient/DeliveryManager?pid=18742447,,,,185271
D-BAs Msc.Lit.25,,008v,8,Aegypte noli flere quia,Dom. 3 Adventus,M,R,5,006056,4,,,,,,,http://digital.bib-bvb.de/webclient/DeliveryManager?pid=18742447,,,,185272
D-BAs Msc.Lit.25,,009r,1,Ecce dominator dominus*,Dom. 3 Adventus,M,V,01,006056a,4,,,,,,,http://digital.bib-bvb.de/webclient/DeliveryManager?pid=18742448,,,,185273
D-BAs Msc.Lit.25,,009r,2,Prope est ut veniat tempus,Dom. 3 Adventus,M,R,6,007438,3,,,,,,,http://digital.bib-bvb.de/webclient/DeliveryManager?pid=18742448,,,,185274
D-BAs Msc.Lit.25,,009r,3,Qui venturus est veniet et,Dom. 3 Adventus,M,V,01,007438a,3,,,,,,,http://digital.bib-bvb.de/webclient/DeliveryManager?pid=18742448,,,,185275
D-BAs Msc.Lit.25,,009r,4,Descendet dominus sicut,Dom. 3 Adventus,M,R,7,006408,4,,,,,,,http://digital.bib-bvb.de/webclient/DeliveryManager?pid=18742448,,,,185276
D-BAs Msc.Lit.25,,009r,5,A solis ortu*,Dom. 3 Adventus,M,V,01,006408a,4,,,,,,,http://digital.bib-bvb.de/webclient/DeliveryManager?pid=18742448,,,,185277
D-BAs Msc.Lit.25,,009r,6,Veni domine et noli tardare,Dom. 3 Adventus,M,R,8,007824,5,,,,,,,http://digital.bib-bvb.de/webclient/DeliveryManager?pid=18742448,,,,185278
D-BAs Msc.Lit.25,,009r,7,A solis ortu*,Dom. 3 Adventus,M,V,01,007824a,5,,,,,,,http://digital.bib-bvb.de/webclient/DeliveryManager?pid=18742448,,,,185279
D-BAs Msc.Lit.25,,009r,8,Ecce radix Jesse ascendit in,Dom. 3 Adventus,M,R,9,006606,8,,,,,,,http://digital.bib-bvb.de/webclient/DeliveryManager?pid=18742448,,,,185280
D-BAs Msc.Lit.25,,009r,9,Deus a Libano*,Dom. 3 Adventus,M,V,01,006606a,8,,,,,,,http://digital.bib-bvb.de/webclient/DeliveryManager?pid=18742448,,,,185281
D-BAs Msc.Lit.25,,009v,1,Docebit nos dominus vias suas,Dom. 3 Adventus,M,R,10,006481,2,,,,,,,http://digital.bib-bvb.de/webclient/DeliveryManager?pid=18742449,,,,185282
D-BAs Msc.Lit.25,,009v,2,Ex Sion species*,Dom. 3 Adventus,M,V,01,006481a,2,,,,,,,http://digital.bib-bvb.de/webclient/DeliveryManager?pid=18742449,,,,185283
D-BAs Msc.Lit.25,,009v,3,Veniet dominus et non,Dom. 3 Adventus,L,A,1,005337,1,,A,64i,,,,http://digital.bib-bvb.de/webclient/DeliveryManager?pid=18742449,,,,185284
D-BAs Msc.Lit.25,,009v,4,Jerusalem gaude gaudio magno,Dom. 3 Adventus,L,A,2,003478,8,,G,123h,,,,http://digital.bib-bvb.de/webclient/DeliveryManager?pid=18742449,,,,185285
D-BAs Msc.Lit.25,,009v,5,Dabo in Sion salutem et ,Dom. 3 Adventus,L,A,3,002094,8,,G,123h,,,,http://digital.bib-bvb.de/webclient/DeliveryManager?pid=18742449,,,,185286
D-BAs Msc.Lit.25,,009v,6,Montes et omnes colles,Dom. 3 Adventus,L,A,4,003806,5,,A,129a,,,,http://digital.bib-bvb.de/webclient/DeliveryManager?pid=18742449,,,,185287