siglum,marginalia,folio,sequence,incipit,feast,office,genre,position,cantus_id,mode,finalis,differentia,differentiae_database,fulltext_standardized,fulltext_ms,volpiano,image_link,melody_id,addendum,extra,node_id
D-AAm G 20,,002r,13,Venite exsultemus domino,Invitatoria,M,IP,,909030,,,TE,,,,,,,,002r,178852
D-AAm G 20,,002v,1,Filiae Sion currite*,Invitatoria,M,I,,001079,2,,*,,,,,,,,002v,178853
D-AAm G 20,,002v,2,Regem regum*,Invitatoria,M,I,,,?,,*,,Regem regum*,,,,,,002v,178854
D-AAm G 20,,002v,3,Surgite vigilemus*,Invitatoria,M,I,,,2,,*,,Surgite vigilemus*,,,,,,002v,178855
D-AAm G 20,,002v,4,Venite exsultemus domino,Invitatoria,M,IP,,909030,,,2,,,,,,,,002v,178856
D-AAm G 20,,003r,1,Regem venturum*,Invitatoria,M,I,,001149,3,,*,,,,,,,,003r,178857
D-AAm G 20,,003r,2,Regem praecursoris dominum*,Invitatoria,M,I,,001140,3,,*,,,,,,,,003r,178858
D-AAm G 20,,003v,1,Venite exsultemus domino,Invitatoria,M,IP,,909030,,,3,,,,,,,,003v,178859
D-AAm G 20,,004r,1,In honore beatissimae*,Invitatoria,M,I,,001086,4,,*,,,,,,,,004r,178860
D-AAm G 20,,004r,2,Deum verum unum*,Invitatoria,M,I,,001061,4,,*,,,,,,,,004r,178861
D-AAm G 20,,004r,3,Venite exsultemus domino,Invitatoria,M,IP,,909030,,,NE,,,,,,,,004r,178862
D-AAm G 20,,004v,1,Christus natus est nobis,Invitatoria,M,I,,001055,4,,*,,,,,,,,004v,178863
D-AAm G 20,,004v,2,Venite exsultemus domino,Invitatoria,M,IP,,909030,,,CH,,,,,,,,004v,178864
D-AAm G 20,,005r,1,Adoremus dominum qui fecit,Invitatoria,M,I,,001009,4,,*,,,,,,,,005r,178865
D-AAm G 20,,005r,2,Hodie scietis*,Invitatoria,M,I,,001084,4,,*,,,,,,,,005r,178866
D-AAm G 20,,005r,3,Hodie nata*,Invitatoria,M,I,,001083,4,,*,,,,,,,,005r,178867
D-AAm G 20,,005r,4,Venite exsultemus domino,Invitatoria,M,IP,,909030,,,GR,,,,,,,,005r,178868
D-AAm G 20,,005v,1,Venite exsultemus domino,Invitatoria,M,I,,001179,4,,*,,,,,,,,005v,178869
D-AAm G 20,,005v,2,Jubilemus deo salutari nostro,Invitatoria,M,IP,,909030,,,MO,,,,,,,,005v,178870
D-AAm G 20,,006r,1,Venite adoremus regem aposto-,Invitatoria,M,I,,100278,4,,*,,,,,,,,006r,178871
D-AAm G 20,,006r,2,Venite exsultemus domino,Invitatoria,M,IP,,909030,,,RE,,,,,,,,006r,178872
D-AAm G 20,,006v,1,Innocentiae auctorem dominum,Invitatoria,M,I,,001091,4,,*,,,,,,,,006v,178873
D-AAm G 20,,006v,2,Venite exsultemus domino,Invitatoria,M,IP,,909030,,,WR,,,,,,,,006v,178874
D-AAm G 20,,007v,1,Dominum qui fecit nos*,Invitatoria,M,I,,001066,5,,*,,,,,,,,007v,178875
D-AAm G 20,,007v,2,Alleluia regem ascendentem*,Invitatoria,M,I,,001029,?,,*,,,,,,,,007v,178876
D-AAm G 20,,007v,3,Venite exsultemus domino,Invitatoria,M,IP,,909030,,,5,,,,,,,,007v,178877
D-AAm G 20,,008r,1,Surrexit dominus vere,Invitatoria,M,I,,001166,6,A,*,,,,,,,,008r,178878
D-AAm G 20,,008r,2,Circumdederunt me*,Invitatoria,M,I,,100089,6T,,*,,,,,,,,008r,178879
D-AAm G 20,,008r,3,Venite exsultemus domino,Invitatoria,M,IP,,909030,,,PA,,,,,,,,008r,178880
D-AAm G 20,,008v,1,Dominum qui fecit mare et,Invitatoria,M,I,,100109,?,,*,,,,,,,,008v,178881
D-AAm G 20,,008v,2,Venite exsultemus domino,Invitatoria,M,IP,,909030,,,FE,,,,,,,,008v,178882
D-AAm G 20,,009r,1,Ave Maria gratia*,Invitatoria,M,I,,001041,7,,*,,,,,,,,009r,178883
D-AAm G 20,,009r,2,Angelorum regi deo*,Invitatoria,M,I,,001037,7,,*,,,,,,,,009r,178884
D-AAm G 20,,009r,3,Venite exsultemus domino,Invitatoria,M,IP,,909030,,,7,,,,,,,,009r,178885
D-AAm G 20,,009v,1,Ubi tentaverunt me*,Invitatoria,M,I,,001168,7,,*,,,,,,,,009v,178886
D-AAm G 20,,009v,2,Quibus juravi in ira mea*,Invitatoria,M,I,,001122,7,,*,,,,,,,,009v,178887
D-AAm G 20,,009v,3,Venite exsultemus domino,Invitatoria,M,IP,,909030,,,HS,,,,,,,,009v,178888
D-AAm G 20,,010r,1,Venite adoremus dominum qui,Invitatoria,M,I,,100276,6,,*,,,,,,,,010r,178889
D-AAm G 20,,010r,2,Venite exsultemus domino,Invitatoria,M,IP,,909030,,,IN,,,,,,,,010r,178890
D-AAm G 20,,010v,1,Plena gratia et veritate,Nativitas Domini,X,,,007840Pzb,,,,,,,,,,,010v,178891
D-AAm G 20,,010v,2,Quem aethera et terra atque,Nativitas Domini,X,,,007840Pzc,,,,,,,,,,,010v,178892
D-AAm G 20,,011r,1,Ecce carissimi dies illa,In tempore Adventus,X,A,,002497,?,D?,*,,,,,,,,011r,178893
D-AAm G 20,,011r,2,Ecce mater nostra Jerusalem,In tempore Adventus,X,AV,01,002497a,?,,*,,,,,,,,011r,178894
D-AAm G 20,,011v,1,Ecce dies veniunt dicit,Dom. 1 Adventus,V,R,,006583,8,,,,,,,,,,011v,178895
D-AAm G 20,,011v,2,In diebus illis salvabitur,Dom. 1 Adventus,V,V,01,006583a,8,,,,,,,,,,011v,178896
D-AAm G 20,,011v,3,Rorate caeli desuper*,Dom. 1 Adventus,V,W,,008188,r,,,,,,,,,,011v,178897
D-AAm G 20,,011v,4,Ecce nomen domini venit de,Dom. 1 Adventus,V,A,M,002527,1,,G1a,66i,,,,,,,011v,178898
D-AAm G 20,,011v,5,Bethleem non es minima in,Dom. 1 Adventus,C,A,N,001737,4,E,D1,50b,,,,,,,011v,178899
D-AAm G 20,,011v,6,Regem venturum dominum venite,Dom. 1 Adventus,M,I,,001149,3,,3,,,,,,,,011v,178900
D-AAm G 20,,011v,7,Erumpent montes jucunditatem,Dom. 1 Adventus,M,A,1.1,002675,7,,B1,142a,,,,,,,011v,178901
D-AAm G 20,,012r,1,Hora est jam nos de ,Dom. 1 Adventus,M,A,1.2,003134,*,,,,,,,,,,001r,178902
D-AAm G 20,,012r,2,Egredietur*,Dom. 1 Adventus,M,W,1.,,*,,,,Egredietur*,,,,,,001r,178903
D-AAm G 20,,012r,3,Aspiciens a longe ecce video,Dom. 1 Adventus,M,R,1.1,006129,7,,,,,,,,,,001r,178904
D-AAm G 20,,012r,4,Quique terrigenae et filii,Dom. 1 Adventus,M,V,01,006129a,7,,,,,,,,,,001r,178905
D-AAm G 20,,012r,5,Qui regis Israel intende qui,Dom. 1 Adventus,M,V,02,006129b,7,,,,,,,,,,001r,178906
D-AAm G 20,,012r,6,Excita domine potentiam tuam,Dom. 1 Adventus,M,V,03,006129d,7,,,,,,,,,,001r,178907
D-AAm G 20,,012r,7,Gloria patri*,Dom. 1 Adventus,M,V,04,909000,7,,,,,,,,,,001r,178908
D-AAm G 20,,012r,8,Aspiciebam in visu noctis et,Dom. 1 Adventus,M,R,1.2,006128,6,,,,,,,,,,001r,178909
D-AAm G 20,,012r,9,Potestas ejus potestas,Dom. 1 Adventus,M,V,01,006128b,6,,,,,,,,,,001r,178910
D-AAm G 20,,012v,1,Missus est Gabriel angelus ad,Dom. 1 Adventus,M,R,1.3,007170,7,,,,,,,,,,001v,178911
D-AAm G 20,,012v,2,Dabit illi dominus deus sedem,Dom. 1 Adventus,M,V,01,007170b,7,,,,,,,,,,001v,178912
D-AAm G 20,,012v,3,Veni domine visitare nos in,Dom. 1 Adventus,M,A,2.1,005321,7,,A1,143b,,,,,,,001v,178913
D-AAm G 20,,012v,4,Scientes quia hora est jam,Dom. 1 Adventus,M,A,2.2,004828,*,,,,,,,,,,001v,178914
D-AAm G 20,,012v,5,Egredietur dominus de loco*,Dom. 1 Adventus,M,W,2.,008043,r,,,,,,,,,,001v,178915
D-AAm G 20,,012v,6,Ave Maria gratia plena,Dom. 1 Adventus,M,R,2.1,006157,7,,,,,,,,,,001v,178916
D-AAm G 20,,012v,7,Quomodo fiet istud quoniam*,Dom. 1 Adventus,M,V,01,006157a,7,,,,,,,,,,001v,178917
D-AAm G 20,,013r,1,Salvatorem exspectamus,Dom. 1 Adventus,M,R,2.2,007562,3,,,,,,,,,,002r,178918
D-AAm G 20,,013r,2,Sobrie et juste et pie,Dom. 1 Adventus,M,V,01,007562b,3,,,,,,,,,,002r,178919
D-AAm G 20,,013r,3,Audite verbum domini gentes,Dom. 1 Adventus,M,R,2.3,006149,3,,,,,,,,,,002r,178920
D-AAm G 20,,013r,4,Annuntiate et auditum facite,Dom. 1 Adventus,M,V,01,006149b,3,,,,,,,,,,002r,178921
D-AAm G 20,,013r,5,Confortate manus dissolutas,Dom. 1 Adventus,M,A,3.,200863,3,,C1,103c,,,,,,,002r,178922
D-AAm G 20,,013r,6,Ex Sion species*,Dom. 1 Adventus,M,W,3.,008060,r,,,,,,,,,,002r,178923
D-AAm G 20,,013r,7,Ecce virgo concipiet et,Dom. 1 Adventus,M,R,3.1,006620,3,,,,,,,,,,002r,178924
D-AAm G 20,,013r,8,Super solium David et super,Dom. 1 Adventus,M,V,01,006620b,3,,,,,,,,,,002r,178925
D-AAm G 20,,013v,1,Obsecro domine mitte quem,Dom. 1 Adventus,M,R,3.2,007305,5,,,,,,,,,,002v,178926
D-AAm G 20,,013v,2,Qui facis misericordiam in,Dom. 1 Adventus,M,V,01,007305zd,5,,,,,,,,,,002v,178927
D-AAm G 20,,013v,3,Laetentur caeli et exsultet,Dom. 1 Adventus,M,R,3.3,007068,2,,,,,,,,,,002v,178928
D-AAm G 20,,013v,4,Tunc exsultabunt omnia ligna,Dom. 1 Adventus,M,V,01,007068za,2,,,,,,,,,,002v,178929
D-AAm G 20,,013v,5,In illa die stillabunt montes,Dom. 1 Adventus,L,A,1,003244,8,,G1,118h,,,,,,,002v,178930
D-AAm G 20,,013v,6,Jucundare filia Sion et,Dom. 1 Adventus,L,A,2,003509,8,,G1,118h,,,,,,,002v,178931
D-AAm G 20,,013v,7,Ecce dominus veniet et omnes,Dom. 1 Adventus,L,A,3,002509,5,,A1,129a,,,,,,,002v,178932
D-AAm G 20,,013v,8,Omnes sitientes venite ad,Dom. 1 Adventus,L,A,4,004133,7,,C1,144a,,,,,,,002v,178933
D-AAm G 20,,014r,1,Ecce veniet propheta magnus,Dom. 1 Adventus,L,A,5,002552,4,,G1,31a,,,,,,,003r,178934
D-AAm G 20,,014r,2,Verbum supernum*,Dom. 1 Adventus,L,H,,008409,,,,,,,,,,,003r,178935
D-AAm G 20,,014r,3,Emitte agnum*,Dom. 1 Adventus,L,W,,008051,r,,,,,,,,,,003r,178936
D-AAm G 20,,014r,4,Spiritus sanctus in te,Dom. 1 Adventus,L,A,1B,005006,8,,G1,118h,,,,,,,003r,178937
D-AAm G 20,,014r,5,Ne timeas Maria invenisti,Dom. 1 Adventus,L,A,2B,003863,8,,G1,118h,,,,,,,003r,178938
D-AAm G 20,,014r,6,In tuo adventu erue nos,Dom. 1 Adventus,P,A,,003302,1,,G1a,66i,,,,,,,003r,178939
D-AAm G 20,,014r,7,Tuam domine excita potentiam,Dom. 1 Adventus,T,A,,005229,4,,A3,,,,,,,,003r,178940
D-AAm G 20,,014r,8,Veni ad liberandum nos domine,Dom. 1 Adventus,T,R,,007823,r,,,,,,,,,,003r,178941
D-AAm G 20,,014r,9,Et ostende faciem tuam et,Dom. 1 Adventus,T,V,01,007823a,r,,,,,,,,,,003r,178942
D-AAm G 20,,014r,10,Timebunt gentes*,Dom. 1 Adventus,T,W,,008221,r,,,,,,,,,,003r,178943
D-AAm G 20,,014r,11,Veni et libera nos deus,Dom. 1 Adventus,S,A,,005324,8,,A2,117a,,,,,,,003r,178944
D-AAm G 20,,014r,12,Ostende nobis domine,Dom. 1 Adventus,S,R,,007343,r,,,,,,,,,,003r,178945
D-AAm G 20,,014r,13,Et salutare tuum da nobis,Dom. 1 Adventus,S,V,01,007343a,r,,,,,,,,,,003r,178946
D-AAm G 20,,014r,14,Memento nostri*,Dom. 1 Adventus,S,W,,008137,r,,,,,,,,,,003r,178947
D-AAm G 20,,014r,15,Confortate*,Dom. 1 Adventus,N,A,,200863,3,,*,,,,,,,,003r,178948
D-AAm G 20,,014r,16,Super te Jerusalem orietur,Dom. 1 Adventus,N,R,,007728,r,,,,,,,,,,003r,178949
D-AAm G 20,,014r,17,Et gloria ejus in te,Dom. 1 Adventus,N,V,01,007728a,r,,,,,,,,,,003r,178950
D-AAm G 20,,014v,1,Domine deus virtutum*,Dom. 1 Adventus,N,W,,008023,r,,,,,,,,,,003v,178951
D-AAm G 20,,014v,2,Dicite filiae Sion ecce rex,Dom. 1 Adventus,V2,A,1M,002201,8,,G2,120d,,,,,,,003v,178952
D-AAm G 20,,014v,3,Missus est Gabriel angelus ad,Dom. 1 Adventus,V2,A,2M,003794,8,,A1,119g,,,,,,,003v,178953
D-AAm G 20,,014v,4,Ecce dominus*,Dom. 1 Adventus,V2,A,3M,002509,5,,*,,,,,,,,003v,178954
D-AAm G 20,,014v,5,Angelus domini nuntiavit,Fer. 2 Hebd. 1 Adv.,E,A,1,001414,1,,G1a,66i,,,,,,,003v,178955
D-AAm G 20,,014v,6,Jerusalem respice ad orientem,Fer. 2 Hebd. 1 Adv.,E,A,2,003481,7,,A1,143b,,,,,,,003v,178956
D-AAm G 20,,014v,7,Antequam convenirent inventa,Fer. 3 Hebd. 1 Adv.,E,A,1,001440,1,,G1a,66i,,,,,,,003v,178957
D-AAm G 20,,014v,8,Quaerite dominum dum inveniri,Fer. 3 Hebd. 1 Adv.,E,A,2,004429,4,,E2,27a,,,,,,,003v,178958
D-AAm G 20,,014v,9,De Sion exibit lex et ,Fer. 4 Hebd. 1 Adv.,E,A,1,002119,2,,D1a,152c,,,,,,,003v,178959
D-AAm G 20,,014v,10,Veniet fortior me post me,Fer. 4 Hebd. 1 Adv.,E,A,2,005339,8,,C1,99d,,,,,,,003v,178960
D-AAm G 20,,014v,11,Benedicta tu in mulieribus et,Fer. 5 Hebd. 1 Adv.,E,A,1,001709,4,,G1,31a,,,,,,,003v,178961
D-AAm G 20,,014v,12,Exspectabo dominum salvatorem,Fer. 5 Hebd. 1 Adv.,E,A,2,002805,4,,G1,31a,,,,,,,003v,178962
D-AAm G 20,,015r,1,Ecce veniet deus et homo ,Fer. 6 Hebd. 1 Adv.,E,A,1,002549,1,,A1a,67c,,,,,,,004r,178963
D-AAm G 20,,015r,2,Ex Aegypto vocavi filium meum,Fer. 6 Hebd. 1 Adv.,E,A,2,002743,4,,G1,31a,,,,,,,004r,178964
D-AAm G 20,,015r,3,Sion noli timere ecce deus,Sabbato Hebd. 1 Adv.,E,A,1,004969,4,,A1,25b,,,,,,,004r,178965
D-AAm G 20,,015r,4,Leva Jerusalem oculos et vide,Sabbato Hebd. 1 Adv.,E,A,2,003606,1,,A1,67c,,,,,,,004r,178966
D-AAm G 20,,015r,5,Rex noster adveniet Christus,Dom. 2 Adventus,M,I,,001155,4,,GR,,,,,,,,004r,178967
D-AAm G 20,,015r,6,Erumpent montes*,Dom. 2 Adventus,M,A,1.,002675,7,,*,,,,,,,,004r,178968
D-AAm G 20,,015r,7,Egredietur virga*,Dom. 2 Adventus,M,W,1.,008044,r,,,,,,,,,,004r,178969
D-AAm G 20,,015r,8,Jerusalem cito veniet salus,Dom. 2 Adventus,M,R,1.1,007031,4,,,,,,,,,,004r,178970
D-AAm G 20,,015r,9,Israel si me audieris non,Dom. 2 Adventus,M,V,01,007031a,4,,,,,,,,,,004r,178971
D-AAm G 20,,015v,1,Ecce dominus veniet et omnes,Dom. 2 Adventus,M,R,1.2,006586,5,,,,,,,,,,004v,178972
D-AAm G 20,,015v,2,Ecce cum virtute veniet et,Dom. 2 Adventus,M,V,01,006586b,5,,,,,,,,,,004v,178973
D-AAm G 20,,015v,3,Jerusalem surge et sta in,Dom. 2 Adventus,M,R,1.3,007034,1,,,,,,,,,,004v,178974
D-AAm G 20,,015v,4,Leva in circuitu oculos tuos,Dom. 2 Adventus,M,V,01,007034a,1,,,,,,,,,,004v,178975
D-AAm G 20,,015v,5,Veni domine*,Dom. 2 Adventus,M,A,2.,005321,7,,*,,,,,,,,004v,178976
D-AAm G 20,,015v,6,Egredietur dominus*,Dom. 2 Adventus,M,W,2.,008043,r,,,,,,,,,,004v,178977
D-AAm G 20,,015v,7,Civitas Jerusalem noli flere,Dom. 2 Adventus,M,R,2.1,006290,1,,,,,,,,,,004v,178978
D-AAm G 20,,015v,8,Ecce in fortitudine veniet et,Dom. 2 Adventus,M,V,01,006290b,1,,,,,,,,,,004v,178979
D-AAm G 20,,015v,9,Ecce veniet dominus protector,Dom. 2 Adventus,M,R,2.2,006613,5,,,,,,,,,,004v,178980
D-AAm G 20,,015v,10,Et dominabitur a mari usque,Dom. 2 Adventus,M,V,01,006613b,5,,,,,,,,,,004v,178981
D-AAm G 20,,016r,1,Sicut mater consolatur filios,Dom. 2 Adventus,M,R,2.3,007660,8,,,,,,,,,,005r,178982
D-AAm G 20,,016r,2,Dabo in Sion salutem et ,Dom. 2 Adventus,M,V,01,007660b,8,,,,,,,,,,005r,178983
D-AAm G 20,,016r,3,Confortate*,Dom. 2 Adventus,M,A,3.,200863,3,,*,,,,,,,,005r,178984
D-AAm G 20,,016r,4,Ex Sion species*,Dom. 2 Adventus,M,W,3.,008060,r,,,,,,,,,,005r,178985
D-AAm G 20,,016r,5,Jerusalem plantabis vineam in,Dom. 2 Adventus,M,R,3.1,007033,8,,,,,,,,,,005r,178986
D-AAm G 20,,016r,6,Exsulta satis filia Sion,Dom. 2 Adventus,M,V,01,007033b,8,,,,,,,,,,005r,178987
D-AAm G 20,,016r,7,Egredietur dominus de Samaria,Dom. 2 Adventus,M,R,3.2,006639,3,,,,,,,,,,005r,178988
D-AAm G 20,,016v,1,Et praeparabitur in,Dom. 2 Adventus,M,V,01,006639b,3,,,,,,,,,,005v,178989
D-AAm G 20,,016v,2,Rex noster adveniet Christus,Dom. 2 Adventus,M,R,3.3,007547,4,,,,,,,,,,005v,178990
D-AAm G 20,,016v,3,Super ipsum continebunt reges,Dom. 2 Adventus,M,V,01,007547b,4,,,,,,,,,,005v,178991
D-AAm G 20,,016v,4,Ecce in nubibus caeli dominus,Dom. 2 Adventus,L,A,1,002515,1,,G1a,66i,,,,,,,005v,178992
D-AAm G 20,,016v,5,Urbs fortitudinis nostrae,Dom. 2 Adventus,L,A,2,005281,7,,D1,147a,,,,,,,005v,178993
D-AAm G 20,,016v,6,Ecce apparebit dominus et non,Dom. 2 Adventus,L,A,3,002492,7,,A1,143b,,,,,,,005v,178994
D-AAm G 20,,016v,7,Montes et colles cantabunt,Dom. 2 Adventus,L,A,4,003805,1,,G1a,66i,,,,,,,005v,178995
D-AAm G 20,,016v,8,Ecce dominus noster cum,Dom. 2 Adventus,L,A,5,002508,3,,C1,103c,,,,,,,005v,178996
D-AAm G 20,,017r,1,Emitte agnum*,Dom. 2 Adventus,L,W,,008051,r,,,,,,,,,,006r,178997
D-AAm G 20,,017r,2,Super solium David et super,Dom. 2 Adventus,L,A,B,005064,8,,G1,118h,,,,,,,006r,178998
D-AAm G 20,,017r,3,Beata es Maria quae,Dom. 2 Adventus,E,A,,001565,8,,G1,118h,,,,,,,006r,178999
D-AAm G 20,,017r,4,De caelo veniet dominator,Fer. 2 Hebd. 2 Adv.,E,A,1,002104,7,,A1,143b,,,,,,,006r,179000
D-AAm G 20,,017r,5,Ecce rex veniet dominus,Fer. 2 Hebd. 2 Adv.,E,A,2,002542,4,,G1,31a,,,,,,,006r,179001
D-AAm G 20,,017r,6,Super te Jerusalem orietur,Fer. 3 Hebd. 2 Adv.,E,A,1,005065,4,,G1,31a,,,,,,,006r,179002
D-AAm G 20,,017r,7,Vox clamantis in deserto,Fer. 3 Hebd. 2 Adv.,E,A,2,005506,5,,G1a,131a,,,,,,,006r,179003
D-AAm G 20,,017r,8,Ecce mitto angelum meum qui,Fer. 4 Hebd. 2 Adv.,E,A,1,002525,7,,A1,143b,,,,,,,006r,179004
D-AAm G 20,,017r,9,Sion renovaberis et videbis,Fer. 4 Hebd. 2 Adv.,E,A,2,004970,4,,A1,25b,,,,,,,006r,179005
D-AAm G 20,,017r,10,Tu es qui venturus es ,Fer. 5 Hebd. 2 Adv.,E,A,1,005210,7,,C1,144a,,,,,,,006r,179006
D-AAm G 20,,017r,11,Qui post me venit ante ,Fer. 5 Hebd. 2 Adv.,E,A,2,004493,4,,G1,31a,,,,,,,006r,179007
D-AAm G 20,,017v,1,Dicite pusillanimes,Fer. 6 Hebd. 2 Adv.,E,A,1,002204,1,,?,,,,,,,,006v,179008
D-AAm G 20,,017v,2,Cantate domino canticum novum,Fer. 6 Hebd. 2 Adv.,E,A,2,001763,7,,A1,143b,,,,,,,006v,179009
D-AAm G 20,,017v,3,Levabit dominus signum in,Sabbato Hebd. 2 Adv.,E,A,1,003607,1,,*,,,,,,,,006v,179010
D-AAm G 20,,017v,4,Ante me non est formatus ,Sabbato Hebd. 2 Adv.,E,A,2,001436,1,,G1a,66i,,,,,,,006v,179011
D-AAm G 20,,017v,5,Ecce venit rex occurramus,Dom. 3 Adventus,M,I,,001074,4,,GR,,,,,,,,006v,179012
D-AAm G 20,,017v,6,Erumpent montes*,Dom. 3 Adventus,M,A,1.,002675,7,,*,,,,,,,,006v,179013
D-AAm G 20,,017v,7,Egredietur*,Dom. 3 Adventus,M,W,1.,,r,,,,Egredietur*,,,,,,006v,179014
D-AAm G 20,,017v,8,Ecce apparebit dominus super,Dom. 3 Adventus,M,R,1.1,006578,1,,,,,,,,,,006v,179015
D-AAm G 20,,017v,9,Apparebit in finem et non,Dom. 3 Adventus,M,V,01,006578a,1,,,,,,,,,,006v,179016
D-AAm G 20,,017v,10,Bethleem civitas dei summi ex,Dom. 3 Adventus,M,R,1.2,006254,7,,,,,,,,,,006v,179017
D-AAm G 20,,018r,1,Loquetur pacem gentibus et,Dom. 3 Adventus,M,V,01,006254c,7T,,,,,,,,,,007r,179018
D-AAm G 20,,018r,2,Qui venturus est veniet et,Dom. 3 Adventus,M,R,1.3,007485,6,,,,,,,,,,007r,179019
D-AAm G 20,,018r,3,Deponet omnes iniquitates,Dom. 3 Adventus,M,V,01,007485b,6,,,,,,,,,,007r,179020
D-AAm G 20,,018r,4,Tu es qui venturus es ,Dom. 3 Adventus,M,A,2.,005209,8,,A1,119g,,,,,,,007r,179021
D-AAm G 20,,018r,5,Egredietur dominus*,Dom. 3 Adventus,M,W,2.,008043,r,,,,,,,,,,007r,179022
D-AAm G 20,,018r,6,Suscipe verbum virgo Maria,Dom. 3 Adventus,M,R,2.1,007744,4,,,,,,,,,,007r,179023
D-AAm G 20,,018r,7,Paries quidem filium et,Dom. 3 Adventus,M,V,01,007744b,4,,,,,,,,,,007r,179024
D-AAm G 20,,018v,1,Aegypte noli flere quia,Dom. 3 Adventus,M,R,2.2,006056,3,,,,,,,,,,007v,179025
D-AAm G 20,,018v,2,Ecce veniet dominus,Dom. 3 Adventus,M,V,01,006056b,3,,,,,,,,,,007v,179026
D-AAm G 20,,018v,3,Prope est ut veniat tempus,Dom. 3 Adventus,M,R,2.3,007438,3,,,,,,,,,,007v,179027
D-AAm G 20,,018v,4,Qui venturus est veniet et,Dom. 3 Adventus,M,V,01,007438a,3,,,,,,,,,,007v,179028
D-AAm G 20,,018v,5,Ite dicite Joanni caeci,Dom. 3 Adventus,M,A,3.,003459,1,,G3,52f,,,,,,,007v,179029
D-AAm G 20,,018v,6,Ex Sion species*,Dom. 3 Adventus,M,W,3.,008060,r,,,,,,,,,,007v,179030
D-AAm G 20,,018v,7,Descendet dominus sicut,Dom. 3 Adventus,M,R,3.1,006408,4,,,,,,,,,,007v,179031
D-AAm G 20,,018v,8,Et adorabunt eum omnes reges,Dom. 3 Adventus,M,V,01,006408b,4,,,,,,,,,,007v,179032
D-AAm G 20,,018v,9,Veni domine et noli tardare,Dom. 3 Adventus,M,R,3.2,007824,7,,,,,,,,,,007v,179033
D-AAm G 20,,019r,1,Excita domine potentiam tuam,Dom. 3 Adventus,M,V,01,007824b,7,,,,,,,,,,008r,179034
D-AAm G 20,,019r,2,Ecce radix Jesse ascendet in,Dom. 3 Adventus,M,R,3.3,006606,8,,,,,,,,,,008r,179035
D-AAm G 20,,019r,3,Deus a Libano veniet et,Dom. 3 Adventus,M,V,01,006606a,8,,,,,,,,,,008r,179036
D-AAm G 20,,019r,4,Veniet dominus et non,Dom. 3 Adventus,L,A,1,005337,1,,G3,52f,,,,,,,008r,179037
D-AAm G 20,,019r,5,Jerusalem gaude gaudio magno,Dom. 3 Adventus,L,A,2,003478,8,,G1,118h,,,,,,,008r,179038
D-AAm G 20,,019r,6,Dabo in Sion salutem et ,Dom. 3 Adventus,L,A,3,002094,8,,G1,118h,,,,,,,008r,179039
D-AAm G 20,,019r,7,Montes et omnes colles,Dom. 3 Adventus,L,A,4,003806,5,,A1a,129a,,,,,,,008r,179040
D-AAm G 20,,019r,8,Juste et pie vivamus,Dom. 3 Adventus,L,A,5,003531,2,,D1,152c,,,,,,,008r,179041
D-AAm G 20,,019r,9,Vox clamantis in deserto,Dom. 3 Adventus,L,W,,008246,r,,,,,,,,,,008r,179042
D-AAm G 20,,019v,1,Joannes autem cum audisset in,Dom. 3 Adventus,L,A,B,003496,1,,G1a,66i,,,,,,,008v,179043
D-AAm G 20,,019v,2,Dicit dominus paenitentiam,Fer. 2 Hebd. 3 Adv.,E,A,1,002195,8,,G1,118h,,,,,,,008v,179044
D-AAm G 20,,019v,3,Beatam me dicent omnes,Fer. 2 Hebd. 3 Adv.,E,A,2,001574,8,,G1,118h,,,,,,,008v,179045
D-AAm G 20,,019v,4,Consurge consurge induere,Fer. 3 Hebd. 3 Adv.,E,A,1,001904,2,,D1a,152c,,,,,,,008v,179046
D-AAm G 20,,019v,5,Elevare elevare consurge,Fer. 3 Hebd. 3 Adv.,E,A,2,002633,8,,G1,118h,,,,,,,008v,179047
D-AAm G 20,,019v,6,Ponam in Sion salutem et ,Fer. 4 Hebd. 3 Adv.,E,A,1,004302,8,,A1,119g,,,,,,,008v,179048
D-AAm G 20,,019v,7,Ponent domino gloriam et,Fer. 4 Hebd. 3 Adv.,E,A,2,004305,5,,A1a,129a,,,,,,,008v,179049
D-AAm G 20,,019v,8,Consolamini consolamini,Fer. 5 Hebd. 3 Adv.,E,A,1,001896,2,,D1a?,,,,,,,,008v,179050
D-AAm G 20,,019v,9,Laetamini cum Jerusalem et,Fer. 5 Hebd. 3 Adv.,E,A,2,003562,5,,A1a,129a,,,,,,,008v,179051
D-AAm G 20,,020r,1,Dies domini sicut fur ita ,Fer. 6 Hebd. 3 Adv.,E,A,1,002215,1,,A1a,67c,,,,,,,009r,179052
D-AAm G 20,,020r,2,Hoc est testimonium quod,Fer. 6 Hebd. 3 Adv.,E,A,2,003082,1,,G1a,66i,,,,,,,009r,179053
D-AAm G 20,,020r,3,Omnis vallis implebitur et,Sabbato Hebd. 3 Adv.,E,A,1,004156,5,,G1,131a,,,,,,,009r,179054
D-AAm G 20,,020r,4,Dabit ei dominus sedem David,Sabbato Hebd. 3 Adv.,E,A,2,002092,1,,G1a,66i,,,,,,,009r,179055
D-AAm G 20,,020r,5,Surgite vigilemus venite,Dom. 4 Adventus,M,I,,001165,2,,2,,,,,,,,009r,179056
D-AAm G 20,,020r,6,Erumpent montes*,Dom. 4 Adventus,M,A,1.,002675,7,,*,,,,,,,,009r,179057
D-AAm G 20,,020r,7,Egredietur virga*,Dom. 4 Adventus,M,W,1.,008044,r,,,,,,,,,,009r,179058
D-AAm G 20,,020r,8,Canite tuba in Sion vocate,Dom. 4 Adventus,M,R,1.1,006265,1,,,,,,,,,,009r,179059
D-AAm G 20,,020r,9,Annuntiate in finibus terrae,Dom. 4 Adventus,M,V,01,006265b,1,,,,,,,,,,009r,179060
D-AAm G 20,,020r,10,Vigesima quarta die decimi,Dom. 4 Adventus,M,R,1.2,007886,7,,,,,,,,,,009r,179061
D-AAm G 20,,020v,1,Ego sum dominus deus vester,Dom. 4 Adventus,M,V,01,007886a,7,,,,,,,,,,009v,179062
D-AAm G 20,,020v,2,Non auferetur sceptrum de,Dom. 4 Adventus,M,R,1.3,007224,2,,,,,,,,,,009v,179063
D-AAm G 20,,020v,3,Pulchriores sunt oculi ejus,Dom. 4 Adventus,M,V,01,007224a,2,,,,,,,,,,009v,179064
D-AAm G 20,,020v,4,Veni domine*,Dom. 4 Adventus,M,A,2.,005321,7,,*,,,,,,,,009v,179065
D-AAm G 20,,020v,5,Me oportet minui illum autem,Dom. 4 Adventus,M,R,2.1,007137,3,,,,,,,,,,009v,179066
D-AAm G 20,,020v,6,Ego baptizavi vos aqua ille,Dom. 4 Adventus,M,V,01,007137b,3,,,,,,,,,,009v,179067
D-AAm G 20,,020v,7,Aeternam veniet plenitudo,Dom. 4 Adventus,M,R,2.2,006596,5,,,,,,,,,,009v,179068
D-AAm G 20,,021r,1,Propter nimiam caritatem suam,Dom. 4 Adventus,M,V,01,006596b,5,,,,,,,,,,010r,179069
D-AAm G 20,,021r,2,Virgo Israel convertere in,Dom. 4 Adventus,M,R,2.3,007903,8,,,,,,,,,,010r,179070
D-AAm G 20,,021r,3,In caritate perpetua dilexi,Dom. 4 Adventus,M,V,01,007903b,8,,,,,,,,,,010r,179071
D-AAm G 20,,021r,4,Confortate*,Dom. 4 Adventus,M,A,3.,200863,3,,*,,,,,,,,010r,179072
D-AAm G 20,,021r,5,Juravi dicit dominus ut ultra,Dom. 4 Adventus,M,R,3.1,007045,8,,,,,,,,,,010r,179073
D-AAm G 20,,021r,6,Juxta est salus mea ut ,Dom. 4 Adventus,M,V,01,007045b,8,,,,,,,,,,010r,179074
D-AAm G 20,,021r,7,Non discedimus a te,Dom. 4 Adventus,M,R,3.2,007227,8,,,,,,,,,,010r,179075
D-AAm G 20,,021r,8,Domine deus virtutum converte,Dom. 4 Adventus,M,V,01,007227a,8,,,,,,,,,,010r,179076
D-AAm G 20,,021v,1,Nascetur nobis parvulus et,Dom. 4 Adventus,M,R,3.3,007195,7,,,,,,,,,,010v,179077
D-AAm G 20,,021v,2,Ecce veniet dominator dominus,Dom. 4 Adventus,M,V,01,007195a,7,,,,,,,,,,010v,179078
D-AAm G 20,,021v,3,Intuemini quantus sit iste,Dom. 4 Adventus,M,R,10,006983,3,,,,,,,,,,010v,179079
D-AAm G 20,,021v,4,Praecursor pro nobis,Dom. 4 Adventus,M,V,01,006983b,3,,,,,,,,,,010v,179080
D-AAm G 20,,021v,5,Canite tuba in Sion quia,Dom. 4 Adventus,L,A,1,001757,1,,G3,52f,,,,,,,010v,179081
D-AAm G 20,,021v,6,Ecce veniet desideratus,Dom. 4 Adventus,L,A,2,002548,1,,G1,66i,,,,,,,010v,179082
D-AAm G 20,,021v,7,Erunt prava in directa et,Dom. 4 Adventus,L,A,3,002676,1,,A1a,67c,,,,,,,010v,179083
D-AAm G 20,,022r,1,Dominus veniet occurrite illi,Dom. 4 Adventus,L,A,4,002423,1,,G1a,66i,,,,,,,011r,179084
D-AAm G 20,,022r,2,Omnipotens sermo tuus domine,Dom. 4 Adventus,L,A,5,004144,2,,D1a,152c,,,,,,,011r,179085
D-AAm G 20,,022r,3,Vox clamantis*,Dom. 4 Adventus,L,W,,008246,r,,,,,,,,,,011r,179086
D-AAm G 20,,022r,4,Dixerunt pharisaei ad Joannem,Dom. 4 Adventus,L,A,B,002264,1,,G1a,66i,,,,,,,011r,179087
D-AAm G 20,,022r,5,Ave Maria gratia plena,Dom. 4 Adventus,V2,A,,001539,1,,D1a,58a,,,,,,,011r,179088
D-AAm G 20,,022r,6,O sapientia quae ex ore,Antiphonae Majores,V,A,1M,004081,2,,D1a,152c,,,,,,,011r,179089