siglum,marginalia,folio,sequence,incipit,feast,office,genre,position,cantus_id,mode,finalis,differentia,differentiae_database,fulltext_standardized,fulltext_ms,volpiano,image_link,melody_id,addendum,extra,node_id
PL-WRu R 503,T,001r,1,Benedictus dominus*,Dom. 1 Adventus,V,A,1,001720,6,,G6,8a,Benedictus dominus*,Benedictus dominus,,,,,,560280
PL-WRu R 503,,001r,2,Ecce dies veniunt dicit dominus ,Dom. 1 Adventus,V,R,,006583,8,,,,Ecce dies veniunt dicit dominus et suscitabo David germen justum et regnabit rex et sapiens erit et faciet judicium et justitiam in terra et hoc est nomen quod vocabunt eum dominus justus noster,Ecce dies veniunt dicit dominus et suscitabo david germen iustum et regnabit rex et sapiens erit et faciet iudicium et iusticiam in terra | Et hoc est nomen quod vocabunt eum dominus iustus noster,,,,,,560281
PL-WRu R 503,,001r,3,In diebus illis salvabitur Juda ,Dom. 1 Adventus,V,V,01,006583a,8,,,,In diebus illis salvabitur Juda et Israel habitabit confidenter,In diebus illis salvabitur iuda et israhel habitabit confidenter | Et,,,,,,560282
PL-WRu R 503,,001r,4,Gloria patri et filio et ,Dom. 1 Adventus,V,V,02,909000,8,,,,Gloria patri et filio et spiritui sancto,Gloria patri et filio et spiritui sancto,,,,,,560283
PL-WRu R 503,,001r,5,Conditor alme*,Dom. 1 Adventus,V,H,,008284,*,,,,Conditor alme*,Conditor alme,,,,,,560284
PL-WRu R 503,,001r,6,Rorate caeli de super*,Dom. 1 Adventus,V,W,,008188,r,,,,Rorate caeli de super*,Rorate celi de super,,,,,,560285
PL-WRu R 503,,001r,7,Ecce nomen domini venit de,Dom. 1 Adventus,V,A,M,002527,1,,D1,72b,Ecce nomen domini venit de longinquo et claritas ejus replet orbem terrarum,Ecce nomen domini venit de longinquo et claritas eius replet orbem terrarum | ~Magnificat,,,,,,560286
PL-WRu R 503,,001r,8,Miserere --*,Dom. 1 Adventus,C,A,,,*,,,,Miserere --*,Miserere --,,,,,,560287
PL-WRu R 503,,001r,9,Veni redemptor*,Dom. 1 Adventus,C,H,,008408a,*,,,,Veni redemptor*,Veni redemptor,,,,,,560288
PL-WRu R 503,,001r,10,Veni domine visitare nos in ,Dom. 1 Adventus,C,A,N,005321,7,,A1,143b,Veni domine visitare nos in pace ut laetemur coram te corde perfecto,Veni domine visitare nos in pace ut laetemur coram te corde perfecto | ~Nunc dimittis,,,,,,560289
PL-WRu R 503,,001r,11,Ecce venit rex occurramus obviam ,Dom. 1 Adventus,M,I,,001074,4,,BL,,Ecce venit rex occurramus obviam salvatori nostro,Ecce venit rex occurramus obviam salvatori nostro | ~Venite,,,,,,560290
PL-WRu R 503,,001r,12,Verbum supernum prodiens*,Dom. 1 Adventus,M,H,,008409,*,,,,Verbum supernum prodiens*,Verbum supernum prodiens,,,,,,560291
PL-WRu R 503,,001r,13,Hora est jam nos de,Dom. 1 Adventus,M,A,1.,003134,8,,G1a,120a,Hora est jam nos de somno surgere et aperti sunt oculi nostri surgere ad Christum quia lux vera est fulgens in caelis,Hora est iam nos de somno surgere et aperti sunt oculi nostri surgere ad xpistum quia lux vera est fulgens in celis,,,,,,560292
PL-WRu R 503,,001r,14,Egredietur virga de radice Jesse*,Dom. 1 Adventus,M,W,1.,008044,*,,,,Egredietur virga de radice Jesse*,Egredietur virga de radice yesse ,,,,,,560293
PL-WRu R 503,,001v,1,Aspiciens a longe ecce video,Dom. 1 Adventus,M,R,1.1,006129,7,,,,Aspiciens a longe ecce video dei potentiam venientem et nebulam totam terram tegentem obviam ei et dicite nuntia nobis si tu es ipse qui regnaturus es in populo Israel,Aspiciens a longe ecce video dei potentiam venientem et nebulam totam terram tegentem obviam ei et dicite Nuntia nobis si tu es ipse | Qui regnaturus es in populo israhel,,,,,,560294
PL-WRu R 503,,001v,2,Quique terrigenae et filii hominum,Dom. 1 Adventus,M,V,01,006129a,7,,,,Quique terrigenae et filii hominum simul in unum dives et pauper,Quique terrigene et filii hominum simul in unum dives et pauper | Ite obviam,,,,,,560295
PL-WRu R 503,,001v,3,Qui regis Israel intende qui,Dom. 1 Adventus,M,V,02,006129b,7,,,,Qui regis Israel intende qui deducis velut ovem Joseph,Qui regis israhel intende qui deducis velud ovem ioseph | Nuncia,,,,,,560296
PL-WRu R 503,,001v,4,Tollite portas principes vestras et,Dom. 1 Adventus,M,V,03,006129c,7,,,,Tollite portas principes vestras et elevamini portae aeternales et introibit,Tollite portas principes vestras et elevamini porte eternales et introibit | Qui regnaturus,,,,,,560297
PL-WRu R 503,,001v,5,Aspiciebam in visu noctis et,Dom. 1 Adventus,M,R,1.2,006128,6,,,,Aspiciebam in visu noctis et ecce in nubibus caeli filius hominis venit et datum est ei regnum et honor et omnis populi tribus et linguae servient ei,Aspiciebam in visu noctis et ecce in nubibus celi filius hominis venit | Et datum est ei regnum et honor et omnis populi tribus et linguae servient ei,,,,,,560298
PL-WRu R 503,,001v,6,Potestas ejus potestas aeterna quae ,Dom. 1 Adventus,M,V,01,006128b,6,,,,Potestas ejus potestas aeterna quae non auferetur et regnum ejus quod non corrumpetur,Potestas eius potestas eterna que non auferetur et regnum eius quod non corrumpetur | Et datum,,,,,,560299
PL-WRu R 503,,001v,7,Missus est Gabriel angelus ad ,Dom. 1 Adventus,M,R,1.3,007170,7,,,,Missus est Gabriel angelus ad Mariam virginem desponsatam Joseph nuntians ei verbum et expavescit virgo de lumine ne timeas Maria invenisti gratiam apud dominum ecce concipies et paries et vocabitur altissimi filius,Missus est gabriel angelus ad mariam virginem desponsatam ioseph nuncians ei verbum et expavescit virgo de lumine ne timeas maria invenisti graciam apud dominum | Ecce concipies et paries et vocabitur altissimi filius,,,,,,560300
PL-WRu R 503,,002r,1,Ave Maria gratia plena dominus ,Dom. 1 Adventus,M,V,01,007170a,7,B,,,Ave Maria gratia plena dominus tecum,Ave maria gracia plena dominus tecum | Ecce concipies,,,,,,560301
PL-WRu R 503,,002r,2,Nox praecessit dies autem appropinquabit ,Dom. 1 Adventus,M,A,2.,003967,4,,E1,27a,Nox praecessit dies autem appropinquabit abiciamus ergo opera tenebrarum et induamur arma lucis sicut in die honeste ambulemus,Nox precessit dies autem appropinquabit abiciamus ergo opera tenebrarum et induamur arma lucis sicut in die honeste ambulemus | ~Conserva,,,,,,560302
PL-WRu R 503,,002r,3,Egredietur dominus de loco sancto ,Dom. 1 Adventus,M,W,2.,008043,*,,,,Egredietur dominus de loco sancto suo R. Veniet ut salvet populum suum,Egredietur dominus de loco sancto suo Veniet ut salvet populum suum,,,,,,560303
PL-WRu R 503,,002r,4,Ave Maria gratia plena dominus,Dom. 1 Adventus,M,R,2.1,006157,7,,,,Ave Maria gratia plena dominus tecum spiritus sanctus superveniet in te et virtus altissimi obumbrabit tibi quod enim ex te nascetur sanctum vocabitur filius dei,Ave maria gracia plena dominus tecum | Spiritus sanctus superveniet in te et virtus altissimi obumbrabit tibi quod enim ex te nascetur sanctum vocabitur filius dei,,,,,,560304
PL-WRu R 503,,002r,5,Quomodo fiet istud quoniam virum ,Dom. 1 Adventus,M,V,01,006157a,7,B,,,Quomodo fiet istud quoniam virum non cognosco et respondens angelus dixit ei,Quomodo fiet istud quoniam virum non cognosco et respondens angelus dixit ei | Spiritus,,,,,,560305
PL-WRu R 503,,002r,6,Salvatorem exspectamus dominum Jesum Christum,Dom. 1 Adventus,M,R,2.2,007562,3,E,,,Salvatorem exspectamus dominum Jesum Christum qui reformabit corpus humilitatis nostrae configuratum corpori claritatis suae,Salvatorem exspectamus dominum ihesum xpistum qui reformabit corpus humilitatis nostre | Configuratum corpori claritatis sue,,,,,,560306
PL-WRu R 503,,002r,7,Sobrie et juste et pie ,Dom. 1 Adventus,M,V,01,007562b,3,G,,,Sobrie et juste et pie vivamus in hoc saeculo exspectantes beatam spem et adventum gloriae magni dei,Sobrie et iuste et pie vivamus in hoc seculo expectantes beatam spem et adventum glorie magni dei | Configuratum,,,,,,560307
PL-WRu R 503,,002r,8,Audite verbum domini gentes et,Dom. 1 Adventus,M,R,2.3,006149,3,E,,,Audite verbum domini gentes et annuntiate illud in finibus terrae et in insulis quae procul sunt dicite salvator noster adveniet,Audite verbum domini gentes et annunciate illud in finibus terre | Et in insulis que procul sunt dicite salvator noster adveniet,,,,,,560308
PL-WRu R 503,,002v,1,Annuntiate et auditum facite loquimini,Dom. 1 Adventus,M,V,01,006149b,3,G,,,Annuntiate et auditum facite loquimini et clamate,Annunciate et auditum facite loquimini et clamate | Et in insulis,,,,,,560309
PL-WRu R 503,,002v,2,Estote parati Christus veniet quia,Dom. 1 Adventus,M,A,3.,201613,6,,F1,7a,Estote parati Christus veniet quia exspectabamus ipse redimet mundum in gloria patris alleluia,Estote parati xpistus veniet quia expectabamus ipse redimet mundum in gloria patris alleluia | ~Celi enarrant,,,,,,560310
PL-WRu R 503,,002v,3,Ex Sion species decoris ejus ,Dom. 1 Adventus,M,W,3.,008060,*,,,,Ex Sion species decoris ejus R. Deus noster manifeste veniet,Ex syon species decoris ejus Deus noster manifeste veniet,,,,,,560311
PL-WRu R 503,,002v,4,Ecce virgo concipiet et pariet ,Dom. 1 Adventus,M,R,3.1,006620,3,E,,,Ecce virgo concipiet et pariet filium dicit dominus et vocabitur nomen ejus admirabilis deus fortis,Ecce virgo concipiet et pariet filium dicit dominus | Et vocabitur nomen eius admirabilis deus fortis,,,,,,560312
PL-WRu R 503,,002v,5,Super solium David et super ,Dom. 1 Adventus,M,V,01,006620b,3,G,,,Super solium David et super regnum ejus sedebit in aeternum,Super solium david et super regnum eius sedebit in eternum | Et vocabitur,,,,,,560313
PL-WRu R 503,,002v,6,Obsecro domine mitte quem missurus,Dom. 1 Adventus,M,R,3.2,007305,5,F,,,Obsecro domine mitte quem missurus es vide afflictionem populi tui sicut locutus es veni et libera nos,Obsecro domine mitte quem missurus es vide afflictionem populi tui | Sicut locutus es veni et libera nos,,,,,,560314
PL-WRu R 503,,002v,7,A solis ortu et occasu ,Dom. 1 Adventus,M,V,01,007305a,5,A,,,A solis ortu et occasu ab aquilone et mari,A solis ortu et occasu ab aquilone et mari | Sicut,,,,,,560315
PL-WRu R 503,,002v,8,Laetentur caeli et exsultet terra,Dom. 1 Adventus,M,R,3.3,007068,2,D,,,Laetentur caeli et exsultet terra jubilate montes laudem quia dominus noster veniet et pauperum suorum miserebitur,Letentur celi et exultet terra iubilate montes laudem quia dominus noster veniet | Et pauperum suorum miserebitur,,,,,,560316
PL-WRu R 503,,002v,9,Ecce dominator dominus cum virtute,Dom. 1 Adventus,M,V,01,007068a,2,D,,,Ecce dominator dominus cum virtute veniet,Ecce dominator dominus cum virtute veniet | Et pauperum,,,,,,560317
PL-WRu R 503,,002v,10,Emitte agnum domine dominatorem terrae ,Dom. 1 Adventus,M,W,,008051,*,,,,Emitte agnum domine dominatorem terrae R. De petra deserti*,Emitte agnum domine dominatorem terre De petra deserti,,,,,,560318
PL-WRu R 503,,002v,11,In illa die stillabunt montes ,Dom. 1 Adventus,L,A,1,003244,8,G,G1,118a,In illa die stillabunt montes dulcedinem et colles fluent lac et mel alleluia,In illa die stillabunt montes dulcedinem et colles fluent lac et mel alleluia | Euouae,,,,,,560319
PL-WRu R 503,,003r,1,Jucundare filia Sion exsulta satis ,Dom. 1 Adventus,L,A,2,003509,8,G,G1a,120a,Jucundare filia Sion exsulta satis filia Jerusalem alleluia,Iucundare filia syon exulta satis filia iherusalem alleluia | Euouae,,,,,,560320
PL-WRu R 503,,003r,2,Ecce dominus veniet et omnes,Dom. 1 Adventus,L,A,3,002509,5,F,A2,129a,Ecce dominus veniet et omnes sancti ejus cum eo et erit in die illa lux magna alleluia,Ecce dominus veniet et omnes sancti eius cum eo et erit in die illa lux magna alleluia | Euouae,,,,,,560321
PL-WRu R 503,,003r,3,Omnes sitientes venite ad aquas ,Dom. 1 Adventus,L,A,4,004133,7,G,C1,144a,Omnes sitientes venite ad aquas quaerite dominum dum inveniri potest alleluia,Omnes sitientes venite ad aquas querite dominum dum inveniri potest alleluia | Euouae,,,,,,560322
PL-WRu R 503,,003r,4,Ecce veniet propheta magnus et,Dom. 1 Adventus,L,A,5,002552,4T,A,E1,T41aA,Ecce veniet propheta magnus et ipse renovabit Jerusalem alleluia,Ecce veniet propheta magnus et ipse renovabit iherusalem alleluia | Euouae,,,,,,560323
PL-WRu R 503,,003r,5,Vox clara*,Dom. 1 Adventus,L,H,,008413,*,,,,Vox clara*,Vox clara,,,,,,560324
PL-WRu R 503,,003r,6,Vox clamantis in deserto R ,Dom. 1 Adventus,L,W,,008246,*,,,,Vox clamantis in deserto R. Parate vias domini rectas facite semitas dei nostri,Vox clamantis in deserto parate vias domini rectas facite semitas dei nostri,,,,,,560325
PL-WRu R 503,,003r,7,Spiritus sanctus in te descendet,Dom. 1 Adventus,L,A,B,005006,8,G,G1,118a,Spiritus sanctus in te descendet Maria ne timeas habebis in utero filium dei alleluia,Spiritus sanctus in te descendet maria ne timeas habebis in utero filium dei alleluia | ~Benedictus,,,,,,560326
PL-WRu R 503,,003r,8,In illa die*,Dom. 1 Adventus,P,A,,003244,*,,,,In illa die*,In illa die,,,,,,560327
PL-WRu R 503,,003r,9,Jam lucis*,Dom. 1 Adventus,P,H,,008328,*,,,,Jam lucis*,Iam lucis,,,,,,560328
PL-WRu R 503,,003r,10,Christe fili dei vivi miserere ,Dom. 1 Adventus,P,R,,006276,r,C,,,Christe fili dei vivi miserere nobis,Xpiste fili dei vivi miserere nobis,,,,,,560329
PL-WRu R 503,,003r,11,Qui sedes ad dexteram patris,Dom. 1 Adventus,P,V,01,006276b,r,C,,,Qui sedes ad dexteram patris,Qui sedes ad dexteram patris | Miserere,,,,,,560330
PL-WRu R 503,,003r,12,Gloria patri et filio et,Dom. 1 Adventus,P,V,02,909000,r,,,,Gloria patri et filio et spiritui sancto,Gloria patri et filio et spiritui sancto,,,,,,560331
PL-WRu R 503,,003r,13,Exsurge domine adjuva*,Dom. 1 Adventus,P,W,,008072,*,,,,Exsurge domine adjuva*,Exurge domine adiuva,,,,,,560332
PL-WRu R 503,,003r,14,Jucundare*,Dom. 1 Adventus,T,A,,003509,*,,,,Jucundare*,Jocundare,,,,,,560333
PL-WRu R 503,,003r,15,Nunc sancte*,Dom. 1 Adventus,T,H,,008354,*,,,,Nunc sancte*,Nunc sancte,,,,,,560334
PL-WRu R 503,,003r,16,Veni ad liberandum nos domine ,Dom. 1 Adventus,T,R,,007823,r,,,,Veni ad liberandum nos domine deus virtutum,Veni ad liberandum nos domine deus virtutum,,,,,,560335
PL-WRu R 503,,003r,17,Et ostende faciem tuam et ,Dom. 1 Adventus,T,V,01,007823a,r,,,,Et ostende faciem tuam et salvi erimus,Et ostende faciem tuam et salvi erimus | nos domine,,,,,,560336
PL-WRu R 503,,003r,18,Gloria patri et filio et ,Dom. 1 Adventus,T,V,02,909000,r,,,,Gloria patri et filio et spiritui sancto,Gloria patri et filio et spiritui sancto,,,,,,560337
PL-WRu R 503,,003r,19,Timebunt gentes nomen tuum domine,Dom. 1 Adventus,T,W,,008221,*,,,,Timebunt gentes nomen tuum domine R. Et omnes reges terrae gloriam tuam,Timebunt gentes nomen tuum domine et omnes reges terre gloriam tuam,,,,,,560338
PL-WRu R 503,,003r,20,Ecce dominus veniet*,Dom. 1 Adventus,S,A,,002509,*,,,,Ecce dominus veniet*,Ecce dominus veniet,,,,,,560339
PL-WRu R 503,,003r,21,Rector potens*,Dom. 1 Adventus,S,H,,008380,*,,,,Rector potens*,Rector potens,,,,,,560340
PL-WRu R 503,,003r,22,Ostende nobis domine misericordiam tuam,Dom. 1 Adventus,S,R,,007343,r,,,,Ostende nobis domine misericordiam tuam,Ostende nobis domine misericordiam tuam,,,,,,560341
PL-WRu R 503,,003r,23,Et salutare tuum da nobis,Dom. 1 Adventus,S,V,01,007343a,r,,,,Et salutare tuum da nobis,Et salutare tuum da nobis,,,,,,560342
PL-WRu R 503,,003r,24,Gloria patri et filio et,Dom. 1 Adventus,S,V,02,909000,r,,,,Gloria patri et filio et spiritui sancto,,,,,,,560343
PL-WRu R 503,,003r,25,Memento nostri domine in beneplacito ,Dom. 1 Adventus,S,W,,008137,*,,,,Memento nostri domine in beneplacito populi tui R. Visita nos in salutari tuo,Memento nostri domine in beneplacito populi tui Visita nos in salutari tuo,,,,,,560344
PL-WRu R 503,,003r,26,Ecce veniet propheta*,Dom. 1 Adventus,N,A,,002552,*,,,,Ecce veniet propheta*,Ecce veniet propheta,,,,,,560345
PL-WRu R 503,,003r,27,Rerum deus*,Dom. 1 Adventus,N,H,,008382,*,,,,Rerum deus*,Rerum deus,,,,,,560346
PL-WRu R 503,,003r,28,Super te Jerusalem orietur dominus,Dom. 1 Adventus,N,R,,007728,r,,,,Super te Jerusalem orietur dominus,Super te iherusalem orietur dominus,,,,,,560347
PL-WRu R 503,,003r,29,Et gloria ejus in te ,Dom. 1 Adventus,N,V,01,007728a,r,,,,Et gloria ejus in te videbitur,Et gloria eius in te videbitur | Orietur,,,,,,560348
PL-WRu R 503,,003r,30,Gloria patri et filio et,Dom. 1 Adventus,N,V,02,909000,r,,,,Gloria patri et filio et spiritui sancto,Gloria patri et filio et spiritui sancto,,,,,,560349
PL-WRu R 503,,003v,1,Domine deus virtutum converte nos,Dom. 1 Adventus,N,W,,008023,*,,,,Domine deus virtutum converte nos R. Et ostende faciem tuam et salvi erimus,Domine deus virtutum converte nos et ostende faciem tuam et salvi erimus,,,,,,560350
PL-WRu R 503,,003v,2,Dixit dominus*,Dom. 1 Adventus,V2,A,1,002285,7,,,,Dixit dominus*,Dixit dominus,,,,,,560351
PL-WRu R 503,,003v,3,Conditor*,Dom. 1 Adventus,V2,H,,008284,*,,,,Conditor*,Conditor,,,,,,560352
PL-WRu R 503,,003v,4,Rorate caeli desuper et nubes ,Dom. 1 Adventus,V2,W,,008188,*,,,,Rorate caeli desuper et nubes pluant justum*,Rorate celi desuper et nubes pluant justum,,,,,,560353
PL-WRu R 503,,003v,5,Ne timeas Maria invenisti gratiam,Dom. 1 Adventus,V2,A,M,003863,8,G,G1,118a,Ne timeas Maria invenisti gratiam apud dominum ecce concipies et paries filium alleluia,Ne timeas Maria invenisti gratiam apud dominum ecce concipies et paries filium alleluia | ~Magnificat,,,,,,560354
PL-WRu R 503,,003v,6,Regem venturum dominum venite adoremus,Fer. 2 Hebd. 1 Adv.,M,I,,001149,6,F,FE,,Regem venturum dominum venite adoremus,Regem venturum dominum venite adoremus | ~Venite,,,,,,560355
PL-WRu R 503,,003v,7,Dominus defensor*,Fer. 2 Hebd. 1 Adv.,M,A,1.,002404,*,,,,Dominus defensor*,Dominus defensor | Dominus illuminatio,,,,,,560356
PL-WRu R 503,,003v,8,Ex Sion species decoris ejus,Fer. 2 Hebd. 1 Adv.,M,W,1.,008060,*,,,,Ex Sion species decoris ejus R. Deus noster manifeste veniet,Ex syon species decoris eius Deus noster manifeste veniet,,,,,,560357
PL-WRu R 503,,003v,9,Aspiciens a longe*,Fer. 2 Hebd. 1 Adv.,M,R,1.1,006129,7,,,,Aspiciens a longe*,Aspiciens a longe,,,,,,560358
PL-WRu R 503,,003v,10,Tollite*,Fer. 2 Hebd. 1 Adv.,M,V,01,006129c,7,,,,Tollite*,Tollite,,,,,,560359
PL-WRu R 503,,003v,11,Aspiciebam in visu*,Fer. 2 Hebd. 1 Adv.,M,R,1.2,006128,*,,,,Aspiciebam in visu*,Aspiciebam in visu,,,,,,560360
PL-WRu R 503,,003v,12,Missus est angelus*,Fer. 2 Hebd. 1 Adv.,M,R,1.3,,*,,,,Missus est angelus*,Missus est angelus,,,,,,560361
PL-WRu R 503,,003v,13,Miserere mei deus,Fer. 2 Hebd. 1 Adv.,L,A,,003773,*,,,,Miserere mei deus,Miserere mei deus,,,,,,560362
PL-WRu R 503,,003v,14,Angelus domini nuntiavit Mariae et,Fer. 2 Hebd. 1 Adv.,L,A,B,001414,1,D,D1,72b,Angelus domini nuntiavit Mariae et concepit de spiritu sancto alleluia,Angelus domini nunciavit marie et concepit de spiritu sancto alleluia | ~Benedictus,,,,,,560363
PL-WRu R 503,,003v,15,Salvatorem expectamus dominum nostrum Jesum,Fer. 2 Hebd. 1 Adv.,P,A,,206008,3,E,F1,95a,Salvatorem expectamus dominum nostrum Jesum Christum qui reformavit corpus humilitatis nostrae configuratum corpori claritatis suae,Salvatorem expectamus dominum nostrum ihesum xpistum qui reformavit corpus humilitatis nostre configuratum corpori claritatis sue |~Deus in nomine,,,,,,560364
PL-WRu R 503,,003v,16,Veni et libera nos deus,Fer. 2 Hebd. 1 Adv.,T,A,,005324,8,G,G1,118a,Veni et libera nos deus noster,Veni et libera nos deus noster | Euouae,,,,,,560365
PL-WRu R 503,,003v,17,Tuam domine excita potentiam et ,Fer. 2 Hebd. 1 Adv.,S,A,,005229,4T,A,G2,T45aA,Tuam domine excita potentiam et veni ad salvandum nos,Tuam domine excita potenciam et veni ad salvandum nos | Euouae,,,,,,560366
PL-WRu R 503,,003v,18,In tuo adventu erue nos,Fer. 2 Hebd. 1 Adv.,N,A,,003302,1,D,D1,72b,In tuo adventu erue nos domine,In tuo adventu erue nos domine | Euouae,,,,,,560367
PL-WRu R 503,,003v,19,Jerusalem respice ad orientem et,Fer. 2 Hebd. 1 Adv.,V,A,M,003481,7,G,A1,143b,Jerusalem respice ad orientem et vide alleluia,Iherusalem respice ad orientem et vide alleluia | ~Magnificat,,,,,,560368
PL-WRu R 503,,003v,20,Antequam convenirent inventa est Maria,Fer. 3 Hebd. 1 Adv.,L,A,B,001440,1,D,D1,72b,Antequam convenirent inventa est Maria habens in utero de spiritu sancto alleluia,Antequam convenirent inventa est maria habens in utero de spiritu sancto alleluia | ~Benedictus,,,,,,560369
PL-WRu R 503,,003v,21,Quaerite dominum dum inveniri potest ,Fer. 3 Hebd. 1 Adv.,V,A,M,004429,4T,A,E1,T41aA,Quaerite dominum dum inveniri potest invocate eum dum prope est alleluia,Querite dominum dum inveniri potest invocate eum dum prope est alleluia | ~Magnificat,,,,,,560370
PL-WRu R 503,,003v,22,De Sion exibit lex et ,Fer. 4 Hebd. 1 Adv.,L,A,B,002119,2T,A,D2,T150c,De Sion exibit lex et verbum domini de Jerusalem,De syon exibit lex et verbum domini de iherusalem | ~Benedictus,,,,,,560371
PL-WRu R 503,,004r,1,Veniet fortior me post me,Fer. 4 Hebd. 1 Adv.,V,A,M,005339,8,G,C2,99d,Veniet fortior me post me cujus non sum dignus solvere corrigiam calciamentorum ejus,Veniet fortior me post me cuius non sum dignus solvere corrigiam calciamentorum eius | ~Magnificat,,,,,,560372
PL-WRu R 503,,004r,2,Benedicta tu in mulieribus et,Fer. 5 Hebd. 1 Adv.,L,A,B,001709,4T,A,G2,T45aA,Benedicta tu in mulieribus et benedictus fructus ventris tui,Benedicta tu in mulieribus et benedictus fructus ventris tui | ~Benedictus,,,,,,560373
PL-WRu R 503,,004r,3,Exspectabo dominum salvatorem meum et ,Fer. 5 Hebd. 1 Adv.,V,A,M,002805,4T,A,G2,T45aA,Exspectabo dominum salvatorem meum et praestolabor eum dum prope est alleluia,Expectabo dominum salvatorem meum et prestolabor eum dum prope est alleluia | ~Magnificat,,,,,,560374
PL-WRu R 503,,004r,4,Ecce veniet deus et homo,Fer. 6 Hebd. 1 Adv.,L,A,B,002549,1,D,A3,67c,Ecce veniet deus et homo de domo David sedere in throno alleluia,Ecce veniet deus et homo de domo david sedere in throno alleluia | ~Benedictus,,,,,,560375
PL-WRu R 503,,004r,5,Ex Aegypto vocavi filium meum ,Fer. 6 Hebd. 1 Adv.,V,A,M,002743,4T,A,G2,T45aA,Ex Aegypto vocavi filium meum veniet ut salvet populum suum,Ex egipto vocavi filium meum veniet ut salvet populum suum | ~Magnificat,,,,,,560376
PL-WRu R 503,,004r,6,Sion noli timere ecce deus ,Sabbato Hebd. 1 Adv.,L,A,B,004969,4T,A,A4,T40aA,Sion noli timere ecce deus tuus veniet alleluia,Syon noli timere ecce deus tuus veniet alleluia | ~Benedictus,,,,,,560377
PL-WRu R 503,,004r,7,Benedictus*,Dom. 2 Adventus,V,A,1,001720,*,,,,Benedictus*,Benedictus,,,,,,560378
PL-WRu R 503,,004r,8,Sicut mater*,Dom. 2 Adventus,V,R,,007660,*,,,,Sicut mater*,Sicut mater,,,,,,560379
PL-WRu R 503,,004r,9,Conditor alme*,Dom. 2 Adventus,V,H,,008284,*,,,,Conditor alme*,Conditor alme,,,,,,560380
PL-WRu R 503,,004r,10,Leva Jerusalem oculos et vide ,Dom. 2 Adventus,V,A,M,003606,1,D,A3,67c,Leva Jerusalem oculos et vide potentiam regis ecce salvator venit solvere te a vinculis,Leva iherusalem oculos et vide potenciam regis ecce salvator venit solvere te a vinculis | ~Magnificat,,,,,,560381
PL-WRu R 503,,004r,11,Rex noster adveniet Christus quem,Dom. 2 Adventus,M,I,,001155,4,E,BL,,Rex noster adveniet Christus quem Joannes praedicabat agnum esse venturum,Rex noster adveniet xpistuc quem iohannes predicabat agnum esse venturum | ~Venite,,,,,,560382
PL-WRu R 503,,004r,12,Hora est jam*,Dom. 2 Adventus,M,A,1.,003134,*,,,,Hora est jam*,Hora est iam,,,,,,560383
PL-WRu R 503,,004r,13,Jerusalem cito veniet salus tua ,Dom. 2 Adventus,M,R,1.1,007031,4,E,,,Jerusalem cito veniet salus tua quare moerore consumeris numquid consiliarius non est tibi quia innovabit te dolor salvabo te et liberabo te noli timere,Iherusalem cito veniet salus tua quare merore consumeris numquid consiliarius non est tibi quia innovabit te dolor | Salvabo te et liberabo te noli timere,,,,,,560384
PL-WRu R 503,,004r,14,Israel si me audieris non ,Dom. 2 Adventus,M,V,01,007031a,4,,,,Israel si me audieris non erit in te deus recens neque adorabis deum alienum ego enim dominus,Israhel si me audieris non erit in te deus recens neque adorabis deum alienum ego enim dominus | Salvabo,,,,,,560385